{"text_format":"1","workbook":"xlsx","n_sheets":5,"sheets":["Data Entry Worksheet","Code","Arrays","UFs","Start Message"],"not_rendered":{"charts":0,"images":0,"macros":1,"external_links":0,"defined_names":18,"comments":0,"pivot_tables":0},"unopened":[],"bounds":{"document_bytes":16777216,"sheet_cells":100000,"rows_first":2000,"rows_last":500,"rows_between":2000,"halvings":0,"cell_chars":16384,"cell_head_chars":4096},"cells_cut":0,"cells_raw":0,"read":"whole","date_system":"1900"}

{"sheet":"Data Entry Worksheet","index":0,"n_rows":100,"n_cols":127,"rows_kept":100,"cut":false,"hidden":true,"merged":[]}
["Transitional Reinsurance Program Supporting Documentation Job Aid",null,null,null,null,null,null,null,null,null,null,null,null,null,null,null,null,null,null,null,null,null,null,null,null,null,null,null,null,null,null,null,null,null,null,null,null,null,null,null,null,null,null,null,null,null,null,null,null,null,null,null,null,null,null,null,null,null,null,null,null,null,null,null,null,null,null,null,null,null,null,"Combined Collection","Two-Part Collection"]
["Reporting Entity Information:",null,null,null,null,null,null,null,null,null,null,null,null,null,null,null,null,null,null,null,null,null,null,null,null,null,null,null,null,null,null,null,null,null,null,null,null,null,null,null,null,null,null,null,null,null,null,null,null,null,null,null,null,null,null,null,null,null,null,null,null,null,null,null,null,null,8,null,null,null,null,"Nonprofit","For Profit"]
[null,"Legal Business Name",null,null,null,null,null,null,null,null,null,null,null,null,null,null,null,null,null,null,null,null,null,null,null,null,null,null,null,null,null,null,null,null,null,null,null,null,null,null,null,null,null,null,null,null,null,null,null,null,null,null,null,null,null,null,null,null,null,null,null,null,null,null,null,null,null,null,null,null,null,{"$f":"Code!C101","v":"Turn error checking Off"},"Turn on automatic error checking"]
[null,null,null,null,null,null,null,null,null,null,null,null,null,null,null,null,null,null,null,null,null,null,null,null,null,null,null,null,null,null,null,null,null,null,null,null,null,null,null,null,null,null,null,null,null,null,null,null,null,null,null,null,null,null,null,null,null,null,null,null,null,null,null,null,null,null,null,null,null,null,null,"Run Data Validation"]
[null,"Federal Tax ID Number",null,null,null,null,null,null,null,null,null,null,null,null,null,null,null,null,null,null,null,null,null,null,null,null,null,null,null,null,null,null,null,null,null,null,null,null,null,null,null,null,null,null,null,null,null,null,null,null,null,null,null,null,null,null,null,null,null,null,null,null,null,null,null,null,null,null,null,null,null,"Create CSV File"]
[null,null,null,null,null,null,null,null,null,null,null,null,null,null,null,null,null,null,null,null,null,null,null,null,null,null,null,null,null,null,null,null,null,null,null,null,null,null,null,null,null,null,null,null,null,null,null,null,null,null,null,null,null,null,null,null,null,null,null,null,null,null,null,null,null,null,null,null,null,null,null,"AL","AK","AZ","AR","CA","CO","CT","DE","DC","FL","GA","HI","ID","IL","IN","IA","KS","KY","LA","ME","MD","MA","MI","MN","MS","MO","MT","NE","NV","NH","NJ","NM","NY","NC","ND","OH","OK","OR","PA","RI","SC","SD","TN","TX","UT","VT","VA","WA","WV","WI","WY","AS","GU","MP","PR","VI"]
[null,"Type of Payment",null,null,null,null,null,null,null,null,null,null,null,null,null,null,null,null,null,null,null,null,null,null,null,null,null,null,null,null,null,null,null,null,null,null,null,null,null,null,null,null,null,null,null,null,null,null,null,null,null,null,null,null,null,null,null,null,null,null,null,null,null,null,null,null,null,null,null,null,null,{"$f":"Arrays!G97","v":2014},{"$f":"Arrays!G98","v":""},{"$f":"Arrays!G99","v":""}]
[null,null,null,null,null,null,null,null,null,null,null,null,null,null,null,null,null,null,null,null,null,null,null,null,null,null,null,null,null,null,null,null,null,null,null,null,null,null,null,null,null,null,null,null,null,null,null,null,null,null,null,null,null,null,null,null,null,null,null,null,null,null,null,null,null,null,null,null,null,null,null,"HII","SI","SISA","MGHPS","MGHPM","OTHER"]
["Data entry status:",null,null,null,null,"User Controls: (select or double click on cell below to initiate action)",null,null,null,null,null,null,null,null,null,null,null,null,null,null,null,null,null,null,null,null,null,null,null,null,null,null,null,null,null,null,null,null,null,null,null,null,null,null,null,null,null,null,null,null,null,null,null,null,null,null,null,null,null,null,null,null,null,null,null,null,null,null,null,null,null,{"$f":"Code!C94","v":"Total = 0, Complete = 0"}]
[null,"Records entered:",null,"Total = 0, Complete = 0",null,null,"Turn Error Checking Off",null,null,null,null,null,null,null,null,null,null,null,null,null,null,null,null,null,null,null,null,null,null,null,null,null,null,null,null,null,null,null,null,null,null,null,null,null,null,null,null,null,null,null,null,null,null,null,null,null,null,null,null,null,null,null,null,null,null,null,null,null,null,null,null,{"$f":"Code!C5","v":0}]
[]
[null,"Sum of annual enrollment",null,0,null,null,"Run Data Validation",null,null,null,null,null,null,null,null,null,null,null,null,null,null,null,null,null,null,null,null,null,null,null,null,null,null,null,null,null,null,null,null,null,null,null,null,null,null,null,null,null,null,null,null,null,null,null,null,null,null,null,null,null,null,null,null,null,null,null,null,null,null,null,null,{"$f":"Code!C95","v":"Sum of annual enrollment"}]
[null,null,null,null,null,null,null,null,null,null,null,null,null,null,null,null,null,null,null,null,null,null,null,null,null,null,null,null,null,null,null,null,null,null,null,null,null,null,null,null,null,null,null,null,null,null,null,null,null,null,null,null,null,null,null,null,null,null,null,null,null,null,null,null,null,null,null,null,null,null,null,{"$f":"Code!D89","v":""}]
[null,null,null,null,null,null,"Create CSV File",null,null,null,null,null,null,null,null,null,null,null,null,null,null,null,null,null,null,null,null,null,null,null,null,null,null,"ma",{"$f":"EXACT(UPPER(A1),A1)","v":false},null,null,null,null,null,null,null,null,null,null,null,null,null,null,null,null,null,null,null,null,null,null,null,null,null,null,null,null,null,null,null,null,null,null,null,null,"Transitional Reinsurance Program Supporting Documentation Job Aid","Reporting Entity Information:","Legal Business Name","Federal Tax ID Number","Type of Payment","Data entry status:","Records entered:","File size (maximum 2 megabytes):","User Controls: (select cell below to initiate action)"]
[]
{"$rows_left_out":86}
{"sheet":"Code","index":1,"n_rows":129,"n_cols":16,"rows_kept":129,"cut":false,"hidden":true,"merged":[]}
["Data Field","Code","Value"]
["Remittance Type",null,{"$f":"IF('Data Entry Worksheet'!D7=\"\",\"\",'Data Entry Worksheet'!D7)","v":""}]
["Maximum enrollment",null,{"$f":"IF(C2=\"\",\"\",IF(ISNA(VLOOKUP(C2,Arrays!G81:H82,2,FALSE)),\"\",VLOOKUP(C2,Arrays!G81:H82,2,FALSE)))","v":""},{"$f":"TEXT(C3,\"#,##0.00\")","v":""}]
["Enrollment Count Prior to Current","EnCtP",0]
["Enrollment Count Current","EnCtC",{"$f":"SUM(INDIRECT(\"'Data Entry Worksheet'!N18:N\"&C12))","v":0},{"$f":"TEXT(C5,\"#,##0.00\")","v":"0.00"}]
["Enrollment Prior Percent of Max","EnPrP",{"$f":"IF(C3=\"\",\"\",C4/C3)","v":""}]
["Enrollment Current Percent of Max","EnPrC",{"$f":"IF(C3=\"\",\"\",C5/C$3)","v":""}]
["Active Row","ActRw",28]
["Enrollment Count Notification Level","EnCtNL",{"$f":"IF(OR(C7<0.25,C7=\"\"),0,IF(C7<0.5, IF(C6<0.25,1,0), IF(C7<0.75,IF(C6<0.5,2,0),IF(C7<0.9,IF(C6<0.75,3,0),IF(C7<=1,IF(C6<0.9,3.6,0),4)))))","v":0}]
["Enrollment Count Notification Text","EnPrMsg",{"$f":"IF(C3=\"\",\"\",\"You have reached \"&ROUND(C7,2)*100&\"% of the maximum Annual Enrollment Count. Your count for this form is currently \"&D5&\". The maximum amount for a \"&C2&\" is \"&D3&\".\")","v":""}]
["Skipped Rows","SkpCt",{"$f":"COUNTIF('Data Entry Worksheet'!P:P,\"Blank\")","v":0}]
["Last Row with a record","LstRw",{"$f":"IF(ISNA(MATCH(MAX('Data Entry Worksheet'!A:A),'Data Entry Worksheet'!A:A,0)),17,MATCH(MAX('Data Entry Worksheet'!A:A),'Data Entry Worksheet'!A:A,0))","v":17}]
["Skipped Row Notification Text","SkpRwMsg",{"$f":"\"There are currently \"&C11&\" blank records in the data entry area of the spreadsheet. Data must be entered in successive rows. Please choose one of the following options to continue.\"","v":"There are currently 0 blank records in the data entry area of the spreadsheet. Data must be entered in successive rows. Please choose one of the following options to continue."}]
["Auto-Error Checking Status","ErrStat","On"]
["Incomplete Rows","IncRc",{"$f":"COUNTIFS('Data Entry Worksheet'!P:P,\"Incomplete\",'Data Entry Worksheet'!S:S,\"<>\"&\"Ignore\")","v":0}]
{"$rows_left_out":115}
{"sheet":"Arrays","index":2,"n_rows":123,"n_cols":15,"rows_kept":123,"cut":false,"hidden":true,"merged":[]}
[null,null,null,null,null,null,"States",null,"ZIPs with 2 starting 0s",null,null,null,"ZIPs with 1 starting 0"]
[]
[null,null,null,null,null,null,"AL","Alabama","NY","New York",5,null,"MA","Massachusetts",1]
[null,null,null,null,null,null,"AK","Alaska","PR","Puerto Rico",6,null,"MA","Massachusetts",2]
["Application Level",null,null,null,null,null,"AZ","Arizona","PR","Puerto Rico",7,null,"MA","Massachusetts",5]
[null,null,null,null,null,null,"AR","Arkansas","PR","Puerto Rico",9,null,"RI","Rhode Island",2]
["Error description","Field","Cell address",null,null,null,"CA","California","VI","Virgin Islands",8,null,"NH","New Hampshire",3]
["Blank row","N/A","Row 23",null,null,null,"CO","Colorado",null,null,null,null,"ME","Maine",3]
["Information missing from required field","State","Cell H40",null,null,null,"CT","Connecticut",null,null,null,null,"ME","Maine",4]
[null,null,null,null,null,null,"DE","Delaware",null,null,null,null,"VT","Vermont",5]
["Field Level Errors",null,null,null,null,null,"DC","District of Columbia",null,null,null,null,"CT","Connecticut",6]
[null,null,null,null,null,null,"FL","Florida",null,null,null,null,"NJ","New Jersey",7]
["Error description","Field","Cell address",null,null,null,"GA","Georgia",null,null,null,null,"NJ","New Jersey",8]
["Data entered does not conform to range of acceptable values","Contributing entity Federal Tax ID","Cell C24",null,null,null,"HI","Hawaii"]
["Data entered does not conform to range of acceptable values","Contributing entity organization type","Cell E36",null,null,null,"ID","Idaho"]
{"$rows_left_out":109}
{"sheet":"UFs","index":3,"n_rows":38,"n_cols":13,"rows_kept":38,"cut":false,"hidden":true,"merged":[]}
[]
[null,null,null,null,null,"Functions",null,null,null,null,"Range Refs"]
["Source","Purpose","Type","Launched from","Calls","Sheet Protect","CutCopyMode","Screen Update","QueryClose","Error Capture","Work Range","Data Entry","Code"]
["Sheet 1",null,null,null,null,null,"Yes",null,"NA","Yes"]
["UF1","RE information missing","Notice and Data Entry","Sheet 1, UF33, UF34","None",null,null,null,"Yes","Yes",null,"D3, D5, D7"]
[{"$f":"\"UF\"&RIGHT(A5,1)+1","v":"UF2"},"Error Correction/Missing Data - Non-specific",null,null,null,null,null,null,"Yes","Yes"]
[{"$f":"\"UF\"&RIGHT(A6,1)+1","v":"UF3"},"Reporting entity LBN too long","Error","Sheet 1",null,null,null,null,"Yes","NA",null,"D3"]
["UF4","Blank row warning","Error","Sheet 1, UF33, UF34","None","Protect/Unprotect, Copy",null,null,"Yes","Yes",null,"Variable","C11-C13"]
["UF5","Cell protection message","Protected Cell","Sheet 1","None","No","No","No","Yes","NA","No","None","None"]
["UF6","Incomplete records warning - auto-error check","Notice","Sheet 1, UF33, UF34","UF7","Protect/Unprotect, Copy",null,null,"Yes","Yes",null,"Svar","C12, C16"]
["UF7","User information for finding incomplete records","Notice","UF6, UF14","None","None",null,null,"Yes","NA",null,"None","None"]
["UF8","Duplicate CE TINs","Error","Sheet 1, UF33, UF34",null,"Protect/Unprotect, Copy",null,null,"Yes","Yes",null,"Qvar","C12, C17"]
["UF9","Special characters will be removed from RE LBN field","Notice","Sheet 1",null,null,null,null,"Yes","Yes",null,"D3","D86"]
["UF10","Invalid value in RE payment type field","Error","Sheet 1","None",null,null,null,"Yes","NA",null,"D7"]
[{"$f":"\"UF\"&RIGHT(A14,2)+1","v":"UF11"},"Invalid RE tax ID","Error","Sheet 1","None",null,null,null,"Yes","NA",null,"D5"]
{"$rows_left_out":24}
{"sheet":"Start Message","index":4,"n_rows":9,"n_cols":2,"rows_kept":9,"cut":false,"hidden":false,"merged":[]}
["Transitional Reinsurance Program Supporting Documentation Job Aid"]
[]
[null,"If you are seeing this sheet, it means that macros are not enabled.  MS Excel requires that you confirm the source of the Excel file by explicitly enabling macros to prevent users from inadvertently downloading harmful Excel files from unknown sources.  For the Job Aid to work correctly, you must enable macros.  Please follow the instructions presented below. "]
[]
[null,"For Excel 2007:"]
[null,"1. Set/confirm the global macro security setting for your computer: click the Office Button and select \"Excel Option\" then \"Trust Center\" then \"Trust Center Settings\" then \"Macro Settings.\"  Select \"Disable all macros with notifications.\"\n2. Enable macros for the Job Aid: click the \"Option\" button and select \"Enable this content.\""]
[]
[null,"For Excel 2010:"]
[null,"If you see the \"Security Warning in the yellow banner at the top of your screen, click on the button \"Enable Content.\n\nYou can also establish a \"Trusted Location that will allow you to continue to work with the Job Aid by enabling macros for all files in the defined location.  To establish a Trusted Location:\n\n1. Set/confirm the global macro security setting for your computer: click the \"File\" tab (upper left corner) and select \"Options\" then \"Trust Center\" then \"Trust Center Settings\" then \"Macro Settings.\"  Select \"Disable all macros with notifications.\" \n2. Enable macros for the Job Aid by setting up a \"Trusted Location\" on your computer where the Job Aid will be run: from the \"Trust Center Settings\" screen, click \"Trusted Locations\" then \"Add New Location.\"  \"Browse\" to the path where you plan to store and run the Job Aid and click \"OK.\" \n\nNote that this procedure will identify the folder as a “trusted location.”  Any spreadsheet stored in the folder will be macro-enabled.  You do not need to identify specific spreadsheets within the folder as macro-enabled, and you will not be able to limit this macro-enabled status to specific spreadsheets.  Therefore, you should not store macro-enabled spreadsheets of unknown origin in this folder. "]