{"text_format":"1","workbook":"xlsx","n_sheets":5,"sheets":["Data Entry Worksheet","Code","Arrays","UFs","Start Message"],"not_rendered":{"charts":0,"images":0,"macros":1,"external_links":0,"defined_names":18,"comments":0,"pivot_tables":0},"unopened":[],"bounds":{"document_bytes":16777216,"sheet_cells":100000,"rows_first":2000,"rows_last":500,"rows_between":2000,"halvings":0,"cell_chars":16384,"cell_head_chars":4096},"cells_cut":0,"cells_raw":0,"read":"whole","date_system":"1900"}

{"sheet":"Data Entry Worksheet","index":0,"n_rows":100,"n_cols":127,"rows_kept":100,"cut":false,"hidden":true,"merged":[]}
["Transitional Reinsurance Program Supporting Documentation Job Aid",null,null,null,null,null,null,null,null,null,null,null,null,null,null,null,null,null,null,null,null,null,null,null,null,null,null,null,null,null,null,null,null,null,null,null,null,null,null,null,null,null,null,null,null,null,null,null,null,null,null,null,null,null,null,null,null,null,null,null,null,null,null,null,null,null,null,null,null,null,null,"Combined Collection","Two-Part Collection"]
["Reporting Entity Information:",null,null,null,null,null,null,null,null,null,null,null,null,null,null,null,null,null,null,null,null,null,null,null,null,null,null,null,null,null,null,null,null,null,null,null,null,null,null,null,null,null,null,null,null,null,null,null,null,null,null,null,null,null,null,null,null,null,null,null,null,null,null,null,null,null,8,null,null,null,null,"Nonprofit","For Profit"]
[null,"Legal Business Name",null,null,null,null,null,null,null,null,null,null,null,null,null,null,null,null,null,null,null,null,null,null,null,null,null,null,null,null,null,null,null,null,null,null,null,null,null,null,null,null,null,null,null,null,null,null,null,null,null,null,null,null,null,null,null,null,null,null,null,null,null,null,null,null,null,null,null,null,null,{"$f":"Code!C101","v":"Turn error checking Off"},"Turn on automatic error checking"]
[null,null,null,null,null,null,null,null,null,null,null,null,null,null,null,null,null,null,null,null,null,null,null,null,null,null,null,null,null,null,null,null,null,null,null,null,null,null,null,null,null,null,null,null,null,null,null,null,null,null,null,null,null,null,null,null,null,null,null,null,null,null,null,null,null,null,null,null,null,null,null,"Run Data Validation"]
[null,"Federal Tax ID Number",null,null,null,null,null,null,null,null,null,null,null,null,null,null,null,null,null,null,null,null,null,null,null,null,null,null,null,null,null,null,null,null,null,null,null,null,null,null,null,null,null,null,null,null,null,null,null,null,null,null,null,null,null,null,null,null,null,null,null,null,null,null,null,null,null,null,null,null,null,"Create CSV File"]
[null,null,null,null,null,null,null,null,null,null,null,null,null,null,null,null,null,null,null,null,null,null,null,null,null,null,null,null,null,null,null,null,null,null,null,null,null,null,null,null,null,null,null,null,null,null,null,null,null,null,null,null,null,null,null,null,null,null,null,null,null,null,null,null,null,null,null,null,null,null,null,"AL","AK","AZ","AR","CA","CO","CT","DE","DC","FL","GA","HI","ID","IL","IN","IA","KS","KY","LA","ME","MD","MA","MI","MN","MS","MO","MT","NE","NV","NH","NJ","NM","NY","NC","ND","OH","OK","OR","PA","RI","SC","SD","TN","TX","UT","VT","VA","WA","WV","WI","WY","AS","GU","MP","PR","VI"]
[null,"Type of Payment",null,null,null,null,null,null,null,null,null,null,null,null,null,null,null,null,null,null,null,null,null,null,null,null,null,null,null,null,null,null,null,null,null,null,null,null,null,null,null,null,null,null,null,null,null,null,null,null,null,null,null,null,null,null,null,null,null,null,null,null,null,null,null,null,null,null,null,null,null,{"$f":"Arrays!G97","v":2014},{"$f":"Arrays!G98","v":""},{"$f":"Arrays!G99","v":""}]
[null,null,null,null,null,null,null,null,null,null,null,null,null,null,null,null,null,null,null,null,null,null,null,null,null,null,null,null,null,null,null,null,null,null,null,null,null,null,null,null,null,null,null,null,null,null,null,null,null,null,null,null,null,null,null,null,null,null,null,null,null,null,null,null,null,null,null,null,null,null,null,"HII","SI","SISA","MGHPS","MGHPM","OTHER"]
["Data entry status:",null,null,null,null,"User Controls: (select or double click on cell below to initiate action)",null,null,null,null,null,null,null,null,null,null,null,null,null,null,null,null,null,null,null,null,null,null,null,null,null,null,null,null,null,null,null,null,null,null,null,null,null,null,null,null,null,null,null,null,null,null,null,null,null,null,null,null,null,null,null,null,null,null,null,null,null,null,null,null,null,{"$f":"Code!C94","v":"Total = 0, Complete = 0"}]
[null,"Records entered:",null,"Total = 0, Complete = 0",null,null,"Turn Error Checking Off",null,null,null,null,null,null,null,null,null,null,null,null,null,null,null,null,null,null,null,null,null,null,null,null,null,null,null,null,null,null,null,null,null,null,null,null,null,null,null,null,null,null,null,null,null,null,null,null,null,null,null,null,null,null,null,null,null,null,null,null,null,null,null,null,{"$f":"Code!C5","v":0}]
[]
[null,"Sum of annual enrollment",null,0,null,null,"Run Data Validation",null,null,null,null,null,null,null,null,null,null,null,null,null,null,null,null,null,null,null,null,null,null,null,null,null,null,null,null,null,null,null,null,null,null,null,null,null,null,null,null,null,null,null,null,null,null,null,null,null,null,null,null,null,null,null,null,null,null,null,null,null,null,null,null,{"$f":"Code!C95","v":"Sum of annual enrollment"}]
[null,null,null,null,null,null,null,null,null,null,null,null,null,null,null,null,null,null,null,null,null,null,null,null,null,null,null,null,null,null,null,null,null,null,null,null,null,null,null,null,null,null,null,null,null,null,null,null,null,null,null,null,null,null,null,null,null,null,null,null,null,null,null,null,null,null,null,null,null,null,null,{"$f":"Code!D89","v":""}]
[null,null,null,null,null,null,"Create CSV File",null,null,null,null,null,null,null,null,null,null,null,null,null,null,null,null,null,null,null,null,null,null,null,null,null,null,"ma",{"$f":"EXACT(UPPER(A1),A1)","v":false},null,null,null,null,null,null,null,null,null,null,null,null,null,null,null,null,null,null,null,null,null,null,null,null,null,null,null,null,null,null,null,null,null,null,null,null,"Transitional Reinsurance Program Supporting Documentation Job Aid","Reporting Entity Information:","Legal Business Name","Federal Tax ID Number","Type of Payment","Data entry status:","Records entered:","File size (maximum 2 megabytes):","User Controls: (select cell below to initiate action)"]
[]
["Table 1. Contributing Entity Information"]
["Record Number\n(pre-filled)","Reporting Entity Legal Business Name (LBN)\n(pre-filled)","Federal Tax ID Number (TIN)\n(pre-filled)","Contributing Entity Legal Business Name (LBN)\n(Maximum 150 characters)","Federal Tax ID Number (TIN)\n(nn-nnnnnnn)","Organization Type\n(For Profit or Nonprofit)","Billing Address Line 1\n(Maximum 150 characters)","Billing Address Line 2 (Optional)\n(Maximum 150 characters)","Billing Address: City\n(Maximum 150 characters)","Billing Address: State\n(2-letter code)","Billing Address: ZIP Code\n(5- or 9-digit)","Domiciliary State\n(2-letter code)","Benefit Year (2014)","Annual Enrollment Count\n(nnnnnnn.nn)","Entity Type\n(HII, SI, SISA, MGHPS, MGHPM, OTHER)","Record Status\n(pre-filled)","Contrib Entity Unique TIN?\n(pre-filled)","Error/Warning Status\n(pre-filled)",null,"CE LBN spec char","CE LBN new val","CE LBN length","CE TIN numbers","CE TIN conform","CE TIN hyphen","Org Type conform","Addr Ln1 spec char","Addr Ln1 new val","Addr Ln1 length","Addr Ln2 spec char","Addr Ln2 new val","Addr Ln2 length","Addr City spec char","Addr City new val","Addr City length","Bill State conform","Bill State new val","ZIP nums","ZIP conform","ZIP num-text","ZIP new val","Dom State conform","Dom State new val","Ben Year conform","Org Typ new val",null,"Enroll Count conform","Enroll Count text","Ent Type conform","Ent Type New Val"]
[{"$f":"IF(COUNTIF(D18:O18,\"\")<>12,ROW()-17,IF(COUNT(INDIRECT(ADDRESS(ROW()+1,COLUMN(),4)&\":A50000\"))>0,ROW()-17,\"\"))","v":""},{"$f":"IF(A18<>\"\",D$3,\"\")","v":""},{"$f":"IF(B18<>\"\",D$5,\"\")","v":""},null,null,null,null,null,null,null,null,null,null,null,null,{"$f":"IF(ISNA(MATCH(MAX(A:A),A:A,0)),\"\",IF(COUNTIF(D18:O18,\"\")=12,IF(ROW()<MATCH(MAX(A:A),A:A,0),\"Blank\",\"\"),IF(COUNTA(D18:G18)+COUNTA(I18:O18)=11,\"Complete\",\"Incomplete\")))","v":""},{"$f":"IF(COUNTIF(D18:O18,\"\")<>12,IF(COUNTIF(E:E,E18)=1,\"Unique\",IF(E18=\"\",\"No TIN Entered\",\"Duplicate\")),\"\")","v":""},{"$f":"IF(COUNTIF(T18:AX18,\"NC\")>0,\"Error\"&IF(COUNTIF(T18:AX18,\"CV\")>0,\"/Format\",\"\"),IF(COUNTIF(T18:AX18,\"CV\")>0,\"Format\",\"\"))","v":""},null,{"$f":"IF(AND(ISERR(FIND(\"*\",D18)),ISERR(FIND(\"<\",D18)),ISERR(FIND(\">\",D18)),ISERR(FIND(\"\\\",D18)),ISERR(FIND(\"/\",D18)),ISERR(FIND(\"%\",D18)),ISERR(FIND(\"^\",D18)),ISERR(FIND(\"`\",D18)),ISERR(FIND(\"{\",D18)),ISERR(FIND(\"}\",D18)),ISERR(FIND(\"~\",D18)),ISERR(FIND(\"[\",D18)),ISERR(FIND(\"]\",D18)),ISERR(FIND(\"!\",D18)),ISERR(FIND(\"&\",D18)),ISERR(FIND(\"+\",D18)),ISERR(FIND(\"=\",D18)),ISERR(FIND(\"?\",D18)),ISERR(FIND(\"#\",D18)),ISERR(FIND(CHAR(34),D18))),\"\",\"CV\")","v":""},{"$f":"IF(T18=\"CV\",SUBSTITUTE(SUBSTITUTE(SUBSTITUTE(SUBSTITUTE(SUBSTITUTE(SUBSTITUTE(SUBSTITUTE(SUBSTITUTE(SUBSTITUTE(SUBSTITUTE(SUBSTITUTE(SUBSTITUTE(SUBSTITUTE(SUBSTITUTE(SUBSTITUTE(SUBSTITUTE(SUBSTITUTE(SUBSTITUTE(SUBSTITUTE(SUBSTITUTE(D18,\"*\",\"\"),\"<\",\"\"),\">\",\"\"),\"\\\",\"\"),\"/\",\"\"),\"%\",\"\"),\"^\",\"\"),\"`\",\"\"),\"{\",\"\"),\"}\",\"\"),\"~\",\"\"),\"[\",\"\"),\"]\",\"\"),\"!\",\"\"),\"&\",\"\"),\"+\",\"\"),\"=\",\"\"),\"?\",\"\"),\"#\",\"\"),CHAR(34),\"\"),\"\")","v":""},{"$f":"IF(LEN(D18)>150,\"NC\",\"\")","v":""},{"$f":"IF(E18<>\"\",LEN(SUM(MID(0&E18,LARGE(ISNUMBER(--MID(E18,ROW(INDIRECT(\"1:\"&LEN(E18))),1))* ROW(INDIRECT(\"1:\"&LEN(E18))),ROW(INDIRECT(\"1:\"&LEN(E18))))+1,1)*10^ROW(INDIRECT(\"1:\"&LEN(E18)))/10)),\"\")","v":""},{"$f":"IF(E18=\"\",\"\",IF(OR(AND(W18=9,LEN(E18)=10,MID(E18,3,1)=\"-\"),AND(W18=8,LEFT(E18,1)=\"0\",LEN(E18)=10,MID(E18,3,1)=\"-\")),\"C\",IF(OR(AND(W18=9,LEN(E18)=9),AND(W18=8,LEFT(E18,1)=\"0\",LEN(E18)=9)),\"CV\",\"NC\")))","v":""},{"$f":"IF(X18=\"CV\",LEFT(E18,2)&\"-\"&RIGHT(E18,7),\"\")","v":""},{"$f":"IF(F18=\"\",\"\",IF(F18=\"Nonprofit\",IF(EXACT(UPPER(LEFT(F18,1)),LEFT(F18,1)),\"C\",\"CV\"),IF(F18=\"For Profit\",IF(AND(EXACT(UPPER(LEFT(F18,1)),LEFT(F18,1)),EXACT(UPPER(MID(F18,5,1)),MID(F18,5,1))),\"C\",\"CV\"),\"NC\")))","v":""},{"$f":"IF(AND(ISERR(FIND(\"*\",G18)),ISERR(FIND(\"<\",G18)),ISERR(FIND(\">\",G18)),ISERR(FIND(\"\\\",G18)),ISERR(FIND(\"/\",G18)),ISERR(FIND(\"%\",G18)),ISERR(FIND(\"^\",G18)),ISERR(FIND(\"`\",G18)),ISERR(FIND(\"{\",G18)),ISERR(FIND(\"}\",G18)),ISERR(FIND(\"~\",G18)),ISERR(FIND(\"[\",G18)),ISERR(FIND(\"]\",G18)),ISERR(FIND(\"!\",G18)),ISERR(FIND(\"&\",G18)),ISERR(FIND(\"+\",G18)),ISERR(FIND(\"=\",G18)),ISERR(FIND(\"?\",G18)),ISERR(FIND(\"#\",G18)),ISERR(FIND(CHAR(34),G18))),\"\",\"CV\")","v":""},{"$f":"IF(AA18=\"CV\",SUBSTITUTE(SUBSTITUTE(SUBSTITUTE(SUBSTITUTE(SUBSTITUTE(SUBSTITUTE(SUBSTITUTE(SUBSTITUTE(SUBSTITUTE(SUBSTITUTE(SUBSTITUTE(SUBSTITUTE(SUBSTITUTE(SUBSTITUTE(SUBSTITUTE(SUBSTITUTE(SUBSTITUTE(SUBSTITUTE(SUBSTITUTE(SUBSTITUTE(G18,\"*\",\"\"),\"<\",\"\"),\">\",\"\"),\"\\\",\"\"),\"/\",\"\"),\"%\",\"\"),\"^\",\"\"),\"`\",\"\"),\"{\",\"\"),\"}\",\"\"),\"~\",\"\"),\"[\",\"\"),\"]\",\"\"),\"!\",\"\"),\"&\",\"\"),\"+\",\"\"),\"=\",\"\"),\"?\",\"\"),\"#\",\"\"),CHAR(34),\"\"),\"\")","v":""},{"$f":"IF(LEN(G18)>150,\"NC\",\"\")","v":""},{"$f":"IF(AND(ISERR(FIND(\"*\",H18)),ISERR(FIND(\"<\",H18)),ISERR(FIND(\">\",H18)),ISERR(FIND(\"\\\",H18)),ISERR(FIND(\"/\",H18)),ISERR(FIND(\"%\",H18)),ISERR(FIND(\"^\",H18)),ISERR(FIND(\"`\",H18)),ISERR(FIND(\"{\",H18)),ISERR(FIND(\"}\",H18)),ISERR(FIND(\"~\",H18)),ISERR(FIND(\"[\",H18)),ISERR(FIND(\"]\",H18)),ISERR(FIND(\"!\",H18)),ISERR(FIND(\"&\",H18)),ISERR(FIND(\"+\",H18)),ISERR(FIND(\"=\",H18)),ISERR(FIND(\"?\",H18)),ISERR(FIND(\"#\",H18)),ISERR(FIND(CHAR(34),H18))),\"\",\"CV\")","v":""},{"$f":"IF(AD18=\"CV\",SUBSTITUTE(SUBSTITUTE(SUBSTITUTE(SUBSTITUTE(SUBSTITUTE(SUBSTITUTE(SUBSTITUTE(SUBSTITUTE(SUBSTITUTE(SUBSTITUTE(SUBSTITUTE(SUBSTITUTE(SUBSTITUTE(SUBSTITUTE(SUBSTITUTE(SUBSTITUTE(SUBSTITUTE(SUBSTITUTE(SUBSTITUTE(SUBSTITUTE(H18,\"*\",\"\"),\"<\",\"\"),\">\",\"\"),\"\\\",\"\"),\"/\",\"\"),\"%\",\"\"),\"^\",\"\"),\"`\",\"\"),\"{\",\"\"),\"}\",\"\"),\"~\",\"\"),\"[\",\"\"),\"]\",\"\"),\"!\",\"\"),\"&\",\"\"),\"+\",\"\"),\"=\",\"\"),\"?\",\"\"),\"#\",\"\"),CHAR(34),\"\"),\"\")","v":""},{"$f":"IF(LEN(H18)>150,\"NC\",\"\")","v":""},{"$f":"IF(AND(ISERR(FIND(\"*\",I18)),ISERR(FIND(\"<\",I18)),ISERR(FIND(\">\",I18)),ISERR(FIND(\"\\\",I18)),ISERR(FIND(\"/\",I18)),ISERR(FIND(\"%\",I18)),ISERR(FIND(\"^\",I18)),ISERR(FIND(\"`\",I18)),ISERR(FIND(\"{\",I18)),ISERR(FIND(\"}\",I18)),ISERR(FIND(\"~\",I18)),ISERR(FIND(\"[\",I18)),ISERR(FIND(\"]\",I18)),ISERR(FIND(\"!\",I18)),ISERR(FIND(\"&\",I18)),ISERR(FIND(\"+\",I18)),ISERR(FIND(\"=\",I18)),ISERR(FIND(\"?\",I18)),ISERR(FIND(\"#\",I18)),ISERR(FIND(CHAR(34),I18))),\"\",\"CV\")","v":""},{"$f":"IF(AG18=\"CV\",SUBSTITUTE(SUBSTITUTE(SUBSTITUTE(SUBSTITUTE(SUBSTITUTE(SUBSTITUTE(SUBSTITUTE(SUBSTITUTE(SUBSTITUTE(SUBSTITUTE(SUBSTITUTE(SUBSTITUTE(SUBSTITUTE(SUBSTITUTE(SUBSTITUTE(SUBSTITUTE(SUBSTITUTE(SUBSTITUTE(SUBSTITUTE(SUBSTITUTE(I18,\"*\",\"\"),\"<\",\"\"),\">\",\"\"),\"\\\",\"\"),\"/\",\"\"),\"%\",\"\"),\"^\",\"\"),\"`\",\"\"),\"{\",\"\"),\"}\",\"\"),\"~\",\"\"),\"[\",\"\"),\"]\",\"\"),\"!\",\"\"),\"&\",\"\"),\"+\",\"\"),\"=\",\"\"),\"?\",\"\"),\"#\",\"\"),CHAR(34),\"\"),\"\")","v":""},{"$f":"IF(LEN(I18)>150,\"NC\",\"\")","v":""},{"$f":"IF(J18=\"\",\"\",IF(ISNA(MATCH(J18,Arrays!$G$3:$G$58,0)),IF(ISNA(MATCH(J18,Arrays!$H$3:$H$58,0)),\"NC\",\"CV\"),IF(EXACT(UPPER(J18),J18),\"C\",\"CV\")))","v":""},{"$f":"IF(AJ18=\"CV\",IF(ISNA(MATCH(J18,Arrays!$G$3:$G$58,0)),INDEX(Arrays!$G$3:$H$58,MATCH(J18,Arrays!$H$3:$H$58,0),1),UPPER(J18)),\"\")","v":""},{"$f":"IF(K18=\"\",\"\",LEN(SUM(MID(0&K18,LARGE(ISNUMBER(--MID(K18,ROW(INDIRECT(\"1:\"&LEN(K18))),1))* ROW(INDIRECT(\"1:\"&LEN(K18))),ROW(INDIRECT(\"1:\"&LEN(K18))))+1,1)*10^ROW(INDIRECT(\"1:\"&LEN(K18)))/10)))","v":""},{"$f":"IF(K18=\"\",\"\",IF(OR(AND(AL18=5,LEN(K18)=5),AND(AL18=9,LEN(K18)=10,MID(K18,6,1)=\"-\"),AND(AL18=4,LEN(K18)=5,LEFT(K18,1)=\"0\"),AND(AL18=8,LEN(K18)=10,MID(K18,6,1)=\"-\",LEFT(K18,1)=\"0\")),\"C\",IF(OR(AND(AL18=9,LEN(K18)=9),AND(AL18=8,LEN(K18)=9,LEFT(K18,1)=\"0\")),\"CV\",\"NC\")))","v":""},{"$f":"IF(K18=\"\",\"\",IF(ISTEXT(K18),\"\",TEXT(K18,\"##\")))","v":""},{"$f":"IF(AN18<>\"CV\",IF(AM18=\"CV\",LEFT(K18,5)&\"-\"&RIGHT(K18,4),\"\"),IF(LEN(K18)=5,TEXT(K18,\"#\"),IF(AN18=\"CV\",LEFT(K18,5)&\"-\"&RIGHT(K18,4),IF(AND(LEN(K18)=3,(COUNTIFS(Arrays!$I$3:$I$7,'Data Entry Worksheet'!J19,Arrays!$K$3:$K$7,LEFT(K18,1))+COUNTIFS(Arrays!$J$3:$J$7,'Data Entry Worksheet'!J19,Arrays!$K$3:$K$7,LEFT(K18,1)))>0),\"00\"&TEXT(K18,\"#\"),IF(AND(LEN(K18)=4,(COUNTIFS(Arrays!$M$3:$M$13,'Data Entry Worksheet'!J19,Arrays!$O$3:$O$13,LEFT(K18,1))+COUNTIFS(Arrays!$N$3:$N$13,'Data Entry Worksheet'!J19,Arrays!$O$3:$O$13,LEFT(K18,1)))>0),\"0\"&TEXT(K18,\"#\"),\"\")))))","v":""},{"$f":"IF(L18=\"\",\"\",IF(ISNA(MATCH(L18,Arrays!$G$3:$G$58,0)),IF(ISNA(MATCH(L18,Arrays!$H$3:$H$58,0)),\"NC\",\"CV\"),IF(EXACT(UPPER(L18),L18),\"C\",\"CV\")))","v":""},{"$f":"IF(AP18=\"CV\",IF(ISNA(MATCH(L18,Arrays!$G$3:$G$58,0)),INDEX(Arrays!$G$3:$H$58,MATCH(L18,Arrays!$H$3:$H$58,0),1),UPPER(L18)),\"\")","v":""},{"$f":"IF(M18=\"\",\"\",IF(ISERR(1*M18),\"NC\",IF(AND(1*M18<=YEAR(TODAY()),1*M18>2013),\"C\",\"NC\")))","v":""},{"$f":"IF(OR(F18=\"C\",F18=\"\"),\"\",IF(F18=\"nonprofit\",\"Nonprofit\",\"For Profit\"))","v":""},{"$f":"IF(AS18=\"CV\",TEXT(M18,\"##\"),\"\")","v":""},{"$f":"IF(N18=\"\",\"\",IF(ISERR(1*N18),\"NC\",IF(ISTEXT(N18),\"TX\",\"C\")))","v":""},{"$f":"IF(AU18=\"TX\",1*N18,\"\")","v":""},{"$f":"IF(O18=\"\",\"\",IF(ISNA(MATCH(O18,Arrays!$G$60:$G$65,0)),\"NC\",IF(EXACT(UPPER(O18),O18),\"C\",\"CV\")))","v":""},{"$f":"IF(AW18=\"\",\"\",UPPER(O18))","v":""}]
[{"$f":"IF(COUNTIF(D19:O19,\"\")<>12,ROW()-17,IF(COUNT(INDIRECT(ADDRESS(ROW()+1,COLUMN(),4)&\":A50000\"))>0,ROW()-17,\"\"))","v":""},{"$f":"IF(A19<>\"\",D$3,\"\")","v":""},{"$f":"IF(B19<>\"\",D$5,\"\")","v":""},null,null,null,null,null,null,null,null,null,null,null,null,"","",{"$f":"IF(COUNTIF(T19:AX19,\"NC\")>0,\"Error\"&IF(COUNTIF(T19:AX19,\"CV\")>0,\"/Format\",\"\"),IF(COUNTIF(T19:AX19,\"CV\")>0,\"Format\",\"\"))","v":""},null,"","","",{"$f":"IF(E19<>\"\",LEN(SUM(MID(0&E19,LARGE(ISNUMBER(--MID(E19,ROW(INDIRECT(\"1:\"&LEN(E19))),1))* ROW(INDIRECT(\"1:\"&LEN(E19))),ROW(INDIRECT(\"1:\"&LEN(E19))))+1,1)*10^ROW(INDIRECT(\"1:\"&LEN(E19)))/10)),\"\")","v":""},{"$f":"IF(E19=\"\",\"\",IF(OR(AND(W19=9,LEN(E19)=10,MID(E19,3,1)=\"-\"),AND(W19=8,LEFT(E19,1)=\"0\",LEN(E19)=10,MID(E19,3,1)=\"-\")),\"C\",IF(OR(AND(W19=9,LEN(E19)=9),AND(W19=8,LEFT(E19,1)=\"0\",LEN(E19)=9)),\"CV\",\"NC\")))","v":""},"","","","","","","","","","","",{"$f":"IF(J19=\"\",\"\",IF(ISNA(MATCH(J19,Arrays!$G$3:$G$58,0)),IF(ISNA(MATCH(J19,Arrays!$H$3:$H$58,0)),\"NC\",\"CV\"),IF(EXACT(UPPER(J19),J19),\"C\",\"CV\")))","v":""},{"$f":"IF(AJ19=\"CV\",IF(ISNA(MATCH(J19,Arrays!$G$3:$G$58,0)),INDEX(Arrays!$G$3:$H$58,MATCH(J19,Arrays!$H$3:$H$58,0),1),UPPER(J19)),\"\")","v":""},{"$f":"IF(K19=\"\",\"\",LEN(SUM(MID(0&K19,LARGE(ISNUMBER(--MID(K19,ROW(INDIRECT(\"1:\"&LEN(K19))),1))* ROW(INDIRECT(\"1:\"&LEN(K19))),ROW(INDIRECT(\"1:\"&LEN(K19))))+1,1)*10^ROW(INDIRECT(\"1:\"&LEN(K19)))/10)))","v":""},"","",{"$f":"IF(AN19<>\"CV\",IF(AM19=\"CV\",LEFT(K19,5)&\"-\"&RIGHT(K19,4),\"\"),IF(LEN(K19)=5,TEXT(K19,\"#\"),IF(AN19=\"CV\",LEFT(K19,5)&\"-\"&RIGHT(K19,4),IF(AND(LEN(K19)=3,(COUNTIFS(Arrays!$I$3:$I$7,'Data Entry Worksheet'!J20,Arrays!$K$3:$K$7,LEFT(K19,1))+COUNTIFS(Arrays!$J$3:$J$7,'Data Entry Worksheet'!J20,Arrays!$K$3:$K$7,LEFT(K19,1)))>0),\"00\"&TEXT(K19,\"#\"),IF(AND(LEN(K19)=4,(COUNTIFS(Arrays!$M$3:$M$13,'Data Entry Worksheet'!J20,Arrays!$O$3:$O$13,LEFT(K19,1))+COUNTIFS(Arrays!$N$3:$N$13,'Data Entry Worksheet'!J20,Arrays!$O$3:$O$13,LEFT(K19,1)))>0),\"0\"&TEXT(K19,\"#\"),\"\")))))","v":""},{"$f":"IF(L19=\"\",\"\",IF(ISNA(MATCH(L19,Arrays!$G$3:$G$58,0)),IF(ISNA(MATCH(L19,Arrays!$H$3:$H$58,0)),\"NC\",\"CV\"),IF(EXACT(UPPER(L19),L19),\"C\",\"CV\")))","v":""},{"$f":"IF(AP19=\"CV\",IF(ISNA(MATCH(L19,Arrays!$G$3:$G$58,0)),INDEX(Arrays!$G$3:$H$58,MATCH(L19,Arrays!$H$3:$H$58,0),1),UPPER(L19)),\"\")","v":""},"","","","","",{"$f":"IF(O19=\"\",\"\",IF(ISNA(MATCH(O19,Arrays!$G$60:$G$65,0)),\"NC\",IF(EXACT(UPPER(O19),O19),\"C\",\"CV\")))","v":""},""]
[{"$f":"IF(COUNTIF(D20:O20,\"\")<>12,ROW()-17,IF(COUNT(INDIRECT(ADDRESS(ROW()+1,COLUMN(),4)&\":A50000\"))>0,ROW()-17,\"\"))","v":""},{"$f":"IF(A20<>\"\",D$3,\"\")","v":""},{"$f":"IF(B20<>\"\",D$5,\"\")","v":""},null,null,null,null,null,null,null,null,null,null,null,null,"","",{"$f":"IF(COUNTIF(T20:AX20,\"NC\")>0,\"Error\"&IF(COUNTIF(T20:AX20,\"CV\")>0,\"/Format\",\"\"),IF(COUNTIF(T20:AX20,\"CV\")>0,\"Format\",\"\"))","v":""},null,"","","",{"$f":"IF(E20<>\"\",LEN(SUM(MID(0&E20,LARGE(ISNUMBER(--MID(E20,ROW(INDIRECT(\"1:\"&LEN(E20))),1))* ROW(INDIRECT(\"1:\"&LEN(E20))),ROW(INDIRECT(\"1:\"&LEN(E20))))+1,1)*10^ROW(INDIRECT(\"1:\"&LEN(E20)))/10)),\"\")","v":""},"","","","","","","","","","","","",{"$f":"IF(J20=\"\",\"\",IF(ISNA(MATCH(J20,Arrays!$G$3:$G$58,0)),IF(ISNA(MATCH(J20,Arrays!$H$3:$H$58,0)),\"NC\",\"CV\"),IF(EXACT(UPPER(J20),J20),\"C\",\"CV\")))","v":""},{"$f":"IF(AJ20=\"CV\",IF(ISNA(MATCH(J20,Arrays!$G$3:$G$58,0)),INDEX(Arrays!$G$3:$H$58,MATCH(J20,Arrays!$H$3:$H$58,0),1),UPPER(J20)),\"\")","v":""},{"$f":"IF(K20=\"\",\"\",LEN(SUM(MID(0&K20,LARGE(ISNUMBER(--MID(K20,ROW(INDIRECT(\"1:\"&LEN(K20))),1))* ROW(INDIRECT(\"1:\"&LEN(K20))),ROW(INDIRECT(\"1:\"&LEN(K20))))+1,1)*10^ROW(INDIRECT(\"1:\"&LEN(K20)))/10)))","v":""},"","",{"$f":"IF(AN20<>\"CV\",IF(AM20=\"CV\",LEFT(K20,5)&\"-\"&RIGHT(K20,4),\"\"),IF(LEN(K20)=5,TEXT(K20,\"#\"),IF(AN20=\"CV\",LEFT(K20,5)&\"-\"&RIGHT(K20,4),IF(AND(LEN(K20)=3,(COUNTIFS(Arrays!$I$3:$I$7,'Data Entry Worksheet'!J22,Arrays!$K$3:$K$7,LEFT(K20,1))+COUNTIFS(Arrays!$J$3:$J$7,'Data Entry Worksheet'!J22,Arrays!$K$3:$K$7,LEFT(K20,1)))>0),\"00\"&TEXT(K20,\"#\"),IF(AND(LEN(K20)=4,(COUNTIFS(Arrays!$M$3:$M$13,'Data Entry Worksheet'!J22,Arrays!$O$3:$O$13,LEFT(K20,1))+COUNTIFS(Arrays!$N$3:$N$13,'Data Entry Worksheet'!J22,Arrays!$O$3:$O$13,LEFT(K20,1)))>0),\"0\"&TEXT(K20,\"#\"),\"\")))))","v":""},{"$f":"IF(L20=\"\",\"\",IF(ISNA(MATCH(L20,Arrays!$G$3:$G$58,0)),IF(ISNA(MATCH(L20,Arrays!$H$3:$H$58,0)),\"NC\",\"CV\"),IF(EXACT(UPPER(L20),L20),\"C\",\"CV\")))","v":""},{"$f":"IF(AP20=\"CV\",IF(ISNA(MATCH(L20,Arrays!$G$3:$G$58,0)),INDEX(Arrays!$G$3:$H$58,MATCH(L20,Arrays!$H$3:$H$58,0),1),UPPER(L20)),\"\")","v":""},"","","","","",{"$f":"IF(O20=\"\",\"\",IF(ISNA(MATCH(O20,Arrays!$G$60:$G$65,0)),\"NC\",IF(EXACT(UPPER(O20),O20),\"C\",\"CV\")))","v":""},""]
[{"$f":"IF(COUNTIF(D21:O21,\"\")<>12,ROW()-17,IF(COUNT(INDIRECT(ADDRESS(ROW()+1,COLUMN(),4)&\":A50000\"))>0,ROW()-17,\"\"))","v":""},{"$f":"IF(A21<>\"\",D$3,\"\")","v":""},{"$f":"IF(B21<>\"\",D$5,\"\")","v":""},null,null,null,null,null,null,null,null,null,null,null,null,"","",{"$f":"IF(COUNTIF(T21:AX21,\"NC\")>0,\"Error\"&IF(COUNTIF(T21:AX21,\"CV\")>0,\"/Format\",\"\"),IF(COUNTIF(T21:AX21,\"CV\")>0,\"Format\",\"\"))","v":""},null,"","","",{"$f":"IF(E21<>\"\",LEN(SUM(MID(0&E21,LARGE(ISNUMBER(--MID(E21,ROW(INDIRECT(\"1:\"&LEN(E21))),1))* ROW(INDIRECT(\"1:\"&LEN(E21))),ROW(INDIRECT(\"1:\"&LEN(E21))))+1,1)*10^ROW(INDIRECT(\"1:\"&LEN(E21)))/10)),\"\")","v":""},"","","","","","","","","","","","",{"$f":"IF(J21=\"\",\"\",IF(ISNA(MATCH(J21,Arrays!$G$3:$G$58,0)),IF(ISNA(MATCH(J21,Arrays!$H$3:$H$58,0)),\"NC\",\"CV\"),IF(EXACT(UPPER(J21),J21),\"C\",\"CV\")))","v":""},{"$f":"IF(AJ21=\"CV\",IF(ISNA(MATCH(J21,Arrays!$G$3:$G$58,0)),INDEX(Arrays!$G$3:$H$58,MATCH(J21,Arrays!$H$3:$H$58,0),1),UPPER(J21)),\"\")","v":""},{"$f":"IF(K21=\"\",\"\",LEN(SUM(MID(0&K21,LARGE(ISNUMBER(--MID(K21,ROW(INDIRECT(\"1:\"&LEN(K21))),1))* ROW(INDIRECT(\"1:\"&LEN(K21))),ROW(INDIRECT(\"1:\"&LEN(K21))))+1,1)*10^ROW(INDIRECT(\"1:\"&LEN(K21)))/10)))","v":""},"","",{"$f":"IF(AN21<>\"CV\",IF(AM21=\"CV\",LEFT(K21,5)&\"-\"&RIGHT(K21,4),\"\"),IF(LEN(K21)=5,TEXT(K21,\"#\"),IF(AN21=\"CV\",LEFT(K21,5)&\"-\"&RIGHT(K21,4),IF(AND(LEN(K21)=3,(COUNTIFS(Arrays!$I$3:$I$7,'Data Entry Worksheet'!J23,Arrays!$K$3:$K$7,LEFT(K21,1))+COUNTIFS(Arrays!$J$3:$J$7,'Data Entry Worksheet'!J23,Arrays!$K$3:$K$7,LEFT(K21,1)))>0),\"00\"&TEXT(K21,\"#\"),IF(AND(LEN(K21)=4,(COUNTIFS(Arrays!$M$3:$M$13,'Data Entry Worksheet'!J23,Arrays!$O$3:$O$13,LEFT(K21,1))+COUNTIFS(Arrays!$N$3:$N$13,'Data Entry Worksheet'!J23,Arrays!$O$3:$O$13,LEFT(K21,1)))>0),\"0\"&TEXT(K21,\"#\"),\"\")))))","v":""},{"$f":"IF(L21=\"\",\"\",IF(ISNA(MATCH(L21,Arrays!$G$3:$G$58,0)),IF(ISNA(MATCH(L21,Arrays!$H$3:$H$58,0)),\"NC\",\"CV\"),IF(EXACT(UPPER(L21),L21),\"C\",\"CV\")))","v":""},{"$f":"IF(AP21=\"CV\",IF(ISNA(MATCH(L21,Arrays!$G$3:$G$58,0)),INDEX(Arrays!$G$3:$H$58,MATCH(L21,Arrays!$H$3:$H$58,0),1),UPPER(L21)),\"\")","v":""},"","","","","",{"$f":"IF(O21=\"\",\"\",IF(ISNA(MATCH(O21,Arrays!$G$60:$G$65,0)),\"NC\",IF(EXACT(UPPER(O21),O21),\"C\",\"CV\")))","v":""},""]
[{"$f":"IF(COUNTIF(D22:O22,\"\")<>12,ROW()-17,IF(COUNT(INDIRECT(ADDRESS(ROW()+1,COLUMN(),4)&\":A50000\"))>0,ROW()-17,\"\"))","v":""},{"$f":"IF(A22<>\"\",D$3,\"\")","v":""},{"$f":"IF(B22<>\"\",D$5,\"\")","v":""},null,null,null,null,null,null,null,null,null,null,null,null,"","",{"$f":"IF(COUNTIF(T22:AX22,\"NC\")>0,\"Error\"&IF(COUNTIF(T22:AX22,\"CV\")>0,\"/Format\",\"\"),IF(COUNTIF(T22:AX22,\"CV\")>0,\"Format\",\"\"))","v":""},null,"","","",{"$f":"IF(E22<>\"\",LEN(SUM(MID(0&E22,LARGE(ISNUMBER(--MID(E22,ROW(INDIRECT(\"1:\"&LEN(E22))),1))* ROW(INDIRECT(\"1:\"&LEN(E22))),ROW(INDIRECT(\"1:\"&LEN(E22))))+1,1)*10^ROW(INDIRECT(\"1:\"&LEN(E22)))/10)),\"\")","v":""},"","","","","","","","","","","","",{"$f":"IF(J22=\"\",\"\",IF(ISNA(MATCH(J22,Arrays!$G$3:$G$58,0)),IF(ISNA(MATCH(J22,Arrays!$H$3:$H$58,0)),\"NC\",\"CV\"),IF(EXACT(UPPER(J22),J22),\"C\",\"CV\")))","v":""},{"$f":"IF(AJ22=\"CV\",IF(ISNA(MATCH(J22,Arrays!$G$3:$G$58,0)),INDEX(Arrays!$G$3:$H$58,MATCH(J22,Arrays!$H$3:$H$58,0),1),UPPER(J22)),\"\")","v":""},{"$f":"IF(K22=\"\",\"\",LEN(SUM(MID(0&K22,LARGE(ISNUMBER(--MID(K22,ROW(INDIRECT(\"1:\"&LEN(K22))),1))* ROW(INDIRECT(\"1:\"&LEN(K22))),ROW(INDIRECT(\"1:\"&LEN(K22))))+1,1)*10^ROW(INDIRECT(\"1:\"&LEN(K22)))/10)))","v":""},"","",{"$f":"IF(AN22<>\"CV\",IF(AM22=\"CV\",LEFT(K22,5)&\"-\"&RIGHT(K22,4),\"\"),IF(LEN(K22)=5,TEXT(K22,\"#\"),IF(AN22=\"CV\",LEFT(K22,5)&\"-\"&RIGHT(K22,4),IF(AND(LEN(K22)=3,(COUNTIFS(Arrays!$I$3:$I$7,'Data Entry Worksheet'!J24,Arrays!$K$3:$K$7,LEFT(K22,1))+COUNTIFS(Arrays!$J$3:$J$7,'Data Entry Worksheet'!J24,Arrays!$K$3:$K$7,LEFT(K22,1)))>0),\"00\"&TEXT(K22,\"#\"),IF(AND(LEN(K22)=4,(COUNTIFS(Arrays!$M$3:$M$13,'Data Entry Worksheet'!J24,Arrays!$O$3:$O$13,LEFT(K22,1))+COUNTIFS(Arrays!$N$3:$N$13,'Data Entry Worksheet'!J24,Arrays!$O$3:$O$13,LEFT(K22,1)))>0),\"0\"&TEXT(K22,\"#\"),\"\")))))","v":""},{"$f":"IF(L22=\"\",\"\",IF(ISNA(MATCH(L22,Arrays!$G$3:$G$58,0)),IF(ISNA(MATCH(L22,Arrays!$H$3:$H$58,0)),\"NC\",\"CV\"),IF(EXACT(UPPER(L22),L22),\"C\",\"CV\")))","v":""},{"$f":"IF(AP22=\"CV\",IF(ISNA(MATCH(L22,Arrays!$G$3:$G$58,0)),INDEX(Arrays!$G$3:$H$58,MATCH(L22,Arrays!$H$3:$H$58,0),1),UPPER(L22)),\"\")","v":""},"","","","","",{"$f":"IF(O22=\"\",\"\",IF(ISNA(MATCH(O22,Arrays!$G$60:$G$65,0)),\"NC\",IF(EXACT(UPPER(O22),O22),\"C\",\"CV\")))","v":""},""]
[{"$f":"IF(COUNTIF(D23:O23,\"\")<>12,ROW()-17,IF(COUNT(INDIRECT(ADDRESS(ROW()+1,COLUMN(),4)&\":A50000\"))>0,ROW()-17,\"\"))","v":""},{"$f":"IF(A23<>\"\",D$3,\"\")","v":""},{"$f":"IF(B23<>\"\",D$5,\"\")","v":""},null,null,null,null,null,null,null,null,null,null,null,null,"","",{"$f":"IF(COUNTIF(T23:AX23,\"NC\")>0,\"Error\"&IF(COUNTIF(T23:AX23,\"CV\")>0,\"/Format\",\"\"),IF(COUNTIF(T23:AX23,\"CV\")>0,\"Format\",\"\"))","v":""},null,"","","",{"$f":"IF(E23<>\"\",LEN(SUM(MID(0&E23,LARGE(ISNUMBER(--MID(E23,ROW(INDIRECT(\"1:\"&LEN(E23))),1))* ROW(INDIRECT(\"1:\"&LEN(E23))),ROW(INDIRECT(\"1:\"&LEN(E23))))+1,1)*10^ROW(INDIRECT(\"1:\"&LEN(E23)))/10)),\"\")","v":""},"","","","","","","","","","","","",{"$f":"IF(J23=\"\",\"\",IF(ISNA(MATCH(J23,Arrays!$G$3:$G$58,0)),IF(ISNA(MATCH(J23,Arrays!$H$3:$H$58,0)),\"NC\",\"CV\"),IF(EXACT(UPPER(J23),J23),\"C\",\"CV\")))","v":""},{"$f":"IF(AJ23=\"CV\",IF(ISNA(MATCH(J23,Arrays!$G$3:$G$58,0)),INDEX(Arrays!$G$3:$H$58,MATCH(J23,Arrays!$H$3:$H$58,0),1),UPPER(J23)),\"\")","v":""},{"$f":"IF(K23=\"\",\"\",LEN(SUM(MID(0&K23,LARGE(ISNUMBER(--MID(K23,ROW(INDIRECT(\"1:\"&LEN(K23))),1))* ROW(INDIRECT(\"1:\"&LEN(K23))),ROW(INDIRECT(\"1:\"&LEN(K23))))+1,1)*10^ROW(INDIRECT(\"1:\"&LEN(K23)))/10)))","v":""},"","",{"$f":"IF(AN23<>\"CV\",IF(AM23=\"CV\",LEFT(K23,5)&\"-\"&RIGHT(K23,4),\"\"),IF(LEN(K23)=5,TEXT(K23,\"#\"),IF(AN23=\"CV\",LEFT(K23,5)&\"-\"&RIGHT(K23,4),IF(AND(LEN(K23)=3,(COUNTIFS(Arrays!$I$3:$I$7,'Data Entry Worksheet'!J25,Arrays!$K$3:$K$7,LEFT(K23,1))+COUNTIFS(Arrays!$J$3:$J$7,'Data Entry Worksheet'!J25,Arrays!$K$3:$K$7,LEFT(K23,1)))>0),\"00\"&TEXT(K23,\"#\"),IF(AND(LEN(K23)=4,(COUNTIFS(Arrays!$M$3:$M$13,'Data Entry Worksheet'!J25,Arrays!$O$3:$O$13,LEFT(K23,1))+COUNTIFS(Arrays!$N$3:$N$13,'Data Entry Worksheet'!J25,Arrays!$O$3:$O$13,LEFT(K23,1)))>0),\"0\"&TEXT(K23,\"#\"),\"\")))))","v":""},{"$f":"IF(L23=\"\",\"\",IF(ISNA(MATCH(L23,Arrays!$G$3:$G$58,0)),IF(ISNA(MATCH(L23,Arrays!$H$3:$H$58,0)),\"NC\",\"CV\"),IF(EXACT(UPPER(L23),L23),\"C\",\"CV\")))","v":""},{"$f":"IF(AP23=\"CV\",IF(ISNA(MATCH(L23,Arrays!$G$3:$G$58,0)),INDEX(Arrays!$G$3:$H$58,MATCH(L23,Arrays!$H$3:$H$58,0),1),UPPER(L23)),\"\")","v":""},"","","","","",{"$f":"IF(O23=\"\",\"\",IF(ISNA(MATCH(O23,Arrays!$G$60:$G$65,0)),\"NC\",IF(EXACT(UPPER(O23),O23),\"C\",\"CV\")))","v":""},""]
[{"$f":"IF(COUNTIF(D24:O24,\"\")<>12,ROW()-17,IF(COUNT(INDIRECT(ADDRESS(ROW()+1,COLUMN(),4)&\":A50000\"))>0,ROW()-17,\"\"))","v":""},{"$f":"IF(A24<>\"\",D$3,\"\")","v":""},{"$f":"IF(B24<>\"\",D$5,\"\")","v":""},null,null,null,null,null,null,null,null,null,null,null,null,"","",{"$f":"IF(COUNTIF(T24:AX24,\"NC\")>0,\"Error\"&IF(COUNTIF(T24:AX24,\"CV\")>0,\"/Format\",\"\"),IF(COUNTIF(T24:AX24,\"CV\")>0,\"Format\",\"\"))","v":""},null,"","","",{"$f":"IF(E24<>\"\",LEN(SUM(MID(0&E24,LARGE(ISNUMBER(--MID(E24,ROW(INDIRECT(\"1:\"&LEN(E24))),1))* ROW(INDIRECT(\"1:\"&LEN(E24))),ROW(INDIRECT(\"1:\"&LEN(E24))))+1,1)*10^ROW(INDIRECT(\"1:\"&LEN(E24)))/10)),\"\")","v":""},"","","","","","","","","","","","",{"$f":"IF(J24=\"\",\"\",IF(ISNA(MATCH(J24,Arrays!$G$3:$G$58,0)),IF(ISNA(MATCH(J24,Arrays!$H$3:$H$58,0)),\"NC\",\"CV\"),IF(EXACT(UPPER(J24),J24),\"C\",\"CV\")))","v":""},{"$f":"IF(AJ24=\"CV\",IF(ISNA(MATCH(J24,Arrays!$G$3:$G$58,0)),INDEX(Arrays!$G$3:$H$58,MATCH(J24,Arrays!$H$3:$H$58,0),1),UPPER(J24)),\"\")","v":""},{"$f":"IF(K24=\"\",\"\",LEN(SUM(MID(0&K24,LARGE(ISNUMBER(--MID(K24,ROW(INDIRECT(\"1:\"&LEN(K24))),1))* ROW(INDIRECT(\"1:\"&LEN(K24))),ROW(INDIRECT(\"1:\"&LEN(K24))))+1,1)*10^ROW(INDIRECT(\"1:\"&LEN(K24)))/10)))","v":""},"","",{"$f":"IF(AN24<>\"CV\",IF(AM24=\"CV\",LEFT(K24,5)&\"-\"&RIGHT(K24,4),\"\"),IF(LEN(K24)=5,TEXT(K24,\"#\"),IF(AN24=\"CV\",LEFT(K24,5)&\"-\"&RIGHT(K24,4),IF(AND(LEN(K24)=3,(COUNTIFS(Arrays!$I$3:$I$7,'Data Entry Worksheet'!J26,Arrays!$K$3:$K$7,LEFT(K24,1))+COUNTIFS(Arrays!$J$3:$J$7,'Data Entry Worksheet'!J26,Arrays!$K$3:$K$7,LEFT(K24,1)))>0),\"00\"&TEXT(K24,\"#\"),IF(AND(LEN(K24)=4,(COUNTIFS(Arrays!$M$3:$M$13,'Data Entry Worksheet'!J26,Arrays!$O$3:$O$13,LEFT(K24,1))+COUNTIFS(Arrays!$N$3:$N$13,'Data Entry Worksheet'!J26,Arrays!$O$3:$O$13,LEFT(K24,1)))>0),\"0\"&TEXT(K24,\"#\"),\"\")))))","v":""},{"$f":"IF(L24=\"\",\"\",IF(ISNA(MATCH(L24,Arrays!$G$3:$G$58,0)),IF(ISNA(MATCH(L24,Arrays!$H$3:$H$58,0)),\"NC\",\"CV\"),IF(EXACT(UPPER(L24),L24),\"C\",\"CV\")))","v":""},{"$f":"IF(AP24=\"CV\",IF(ISNA(MATCH(L24,Arrays!$G$3:$G$58,0)),INDEX(Arrays!$G$3:$H$58,MATCH(L24,Arrays!$H$3:$H$58,0),1),UPPER(L24)),\"\")","v":""},"","","","","",{"$f":"IF(O24=\"\",\"\",IF(ISNA(MATCH(O24,Arrays!$G$60:$G$65,0)),\"NC\",IF(EXACT(UPPER(O24),O24),\"C\",\"CV\")))","v":""},""]
["","","",null,null,null,null,null,null,null,null,null,null,null,null,"","","",null,"","","",{"$f":"IF(E25<>\"\",LEN(SUM(MID(0&E25,LARGE(ISNUMBER(--MID(E25,ROW(INDIRECT(\"1:\"&LEN(E25))),1))* ROW(INDIRECT(\"1:\"&LEN(E25))),ROW(INDIRECT(\"1:\"&LEN(E25))))+1,1)*10^ROW(INDIRECT(\"1:\"&LEN(E25)))/10)),\"\")","v":""},"","","","","","","","","","","","",{"$f":"IF(J25=\"\",\"\",IF(ISNA(MATCH(J25,Arrays!$G$3:$G$58,0)),IF(ISNA(MATCH(J25,Arrays!$H$3:$H$58,0)),\"NC\",\"CV\"),IF(EXACT(UPPER(J25),J25),\"C\",\"CV\")))","v":""},{"$f":"IF(AJ25=\"CV\",IF(ISNA(MATCH(J25,Arrays!$G$3:$G$58,0)),INDEX(Arrays!$G$3:$H$58,MATCH(J25,Arrays!$H$3:$H$58,0),1),UPPER(J25)),\"\")","v":""},{"$f":"IF(K25=\"\",\"\",LEN(SUM(MID(0&K25,LARGE(ISNUMBER(--MID(K25,ROW(INDIRECT(\"1:\"&LEN(K25))),1))* ROW(INDIRECT(\"1:\"&LEN(K25))),ROW(INDIRECT(\"1:\"&LEN(K25))))+1,1)*10^ROW(INDIRECT(\"1:\"&LEN(K25)))/10)))","v":""},"","",{"$f":"IF(AN25<>\"CV\",IF(AM25=\"CV\",LEFT(K25,5)&\"-\"&RIGHT(K25,4),\"\"),IF(LEN(K25)=5,TEXT(K25,\"#\"),IF(AN25=\"CV\",LEFT(K25,5)&\"-\"&RIGHT(K25,4),IF(AND(LEN(K25)=3,(COUNTIFS(Arrays!$I$3:$I$7,'Data Entry Worksheet'!J27,Arrays!$K$3:$K$7,LEFT(K25,1))+COUNTIFS(Arrays!$J$3:$J$7,'Data Entry Worksheet'!J27,Arrays!$K$3:$K$7,LEFT(K25,1)))>0),\"00\"&TEXT(K25,\"#\"),IF(AND(LEN(K25)=4,(COUNTIFS(Arrays!$M$3:$M$13,'Data Entry Worksheet'!J27,Arrays!$O$3:$O$13,LEFT(K25,1))+COUNTIFS(Arrays!$N$3:$N$13,'Data Entry Worksheet'!J27,Arrays!$O$3:$O$13,LEFT(K25,1)))>0),\"0\"&TEXT(K25,\"#\"),\"\")))))","v":""},{"$f":"IF(L25=\"\",\"\",IF(ISNA(MATCH(L25,Arrays!$G$3:$G$58,0)),IF(ISNA(MATCH(L25,Arrays!$H$3:$H$58,0)),\"NC\",\"CV\"),IF(EXACT(UPPER(L25),L25),\"C\",\"CV\")))","v":""},{"$f":"IF(AP25=\"CV\",IF(ISNA(MATCH(L25,Arrays!$G$3:$G$58,0)),INDEX(Arrays!$G$3:$H$58,MATCH(L25,Arrays!$H$3:$H$58,0),1),UPPER(L25)),\"\")","v":""},"","","","","",{"$f":"IF(O25=\"\",\"\",IF(ISNA(MATCH(O25,Arrays!$G$60:$G$65,0)),\"NC\",IF(EXACT(UPPER(O25),O25),\"C\",\"CV\")))","v":""},""]
["","","",null,null,null,null,null,null,null,null,null,null,null,null,"","","",null,"","","",{"$f":"IF(E26<>\"\",LEN(SUM(MID(0&E26,LARGE(ISNUMBER(--MID(E26,ROW(INDIRECT(\"1:\"&LEN(E26))),1))* ROW(INDIRECT(\"1:\"&LEN(E26))),ROW(INDIRECT(\"1:\"&LEN(E26))))+1,1)*10^ROW(INDIRECT(\"1:\"&LEN(E26)))/10)),\"\")","v":""},"","","","","","","","","","","","",{"$f":"IF(J26=\"\",\"\",IF(ISNA(MATCH(J26,Arrays!$G$3:$G$58,0)),IF(ISNA(MATCH(J26,Arrays!$H$3:$H$58,0)),\"NC\",\"CV\"),IF(EXACT(UPPER(J26),J26),\"C\",\"CV\")))","v":""},{"$f":"IF(AJ26=\"CV\",IF(ISNA(MATCH(J26,Arrays!$G$3:$G$58,0)),INDEX(Arrays!$G$3:$H$58,MATCH(J26,Arrays!$H$3:$H$58,0),1),UPPER(J26)),\"\")","v":""},{"$f":"IF(K26=\"\",\"\",LEN(SUM(MID(0&K26,LARGE(ISNUMBER(--MID(K26,ROW(INDIRECT(\"1:\"&LEN(K26))),1))* ROW(INDIRECT(\"1:\"&LEN(K26))),ROW(INDIRECT(\"1:\"&LEN(K26))))+1,1)*10^ROW(INDIRECT(\"1:\"&LEN(K26)))/10)))","v":""},"","",{"$f":"IF(AN26<>\"CV\",IF(AM26=\"CV\",LEFT(K26,5)&\"-\"&RIGHT(K26,4),\"\"),IF(LEN(K26)=5,TEXT(K26,\"#\"),IF(AN26=\"CV\",LEFT(K26,5)&\"-\"&RIGHT(K26,4),IF(AND(LEN(K26)=3,(COUNTIFS(Arrays!$I$3:$I$7,'Data Entry Worksheet'!J28,Arrays!$K$3:$K$7,LEFT(K26,1))+COUNTIFS(Arrays!$J$3:$J$7,'Data Entry Worksheet'!J28,Arrays!$K$3:$K$7,LEFT(K26,1)))>0),\"00\"&TEXT(K26,\"#\"),IF(AND(LEN(K26)=4,(COUNTIFS(Arrays!$M$3:$M$13,'Data Entry Worksheet'!J28,Arrays!$O$3:$O$13,LEFT(K26,1))+COUNTIFS(Arrays!$N$3:$N$13,'Data Entry Worksheet'!J28,Arrays!$O$3:$O$13,LEFT(K26,1)))>0),\"0\"&TEXT(K26,\"#\"),\"\")))))","v":""},{"$f":"IF(L26=\"\",\"\",IF(ISNA(MATCH(L26,Arrays!$G$3:$G$58,0)),IF(ISNA(MATCH(L26,Arrays!$H$3:$H$58,0)),\"NC\",\"CV\"),IF(EXACT(UPPER(L26),L26),\"C\",\"CV\")))","v":""},{"$f":"IF(AP26=\"CV\",IF(ISNA(MATCH(L26,Arrays!$G$3:$G$58,0)),INDEX(Arrays!$G$3:$H$58,MATCH(L26,Arrays!$H$3:$H$58,0),1),UPPER(L26)),\"\")","v":""},"","","","","",{"$f":"IF(O26=\"\",\"\",IF(ISNA(MATCH(O26,Arrays!$G$60:$G$65,0)),\"NC\",IF(EXACT(UPPER(O26),O26),\"C\",\"CV\")))","v":""},""]
["","","",null,null,null,null,null,null,null,null,null,null,null,null,"","","",null,"","","",{"$f":"IF(E27<>\"\",LEN(SUM(MID(0&E27,LARGE(ISNUMBER(--MID(E27,ROW(INDIRECT(\"1:\"&LEN(E27))),1))* ROW(INDIRECT(\"1:\"&LEN(E27))),ROW(INDIRECT(\"1:\"&LEN(E27))))+1,1)*10^ROW(INDIRECT(\"1:\"&LEN(E27)))/10)),\"\")","v":""},"","","","","","","","","","","","",{"$f":"IF(J27=\"\",\"\",IF(ISNA(MATCH(J27,Arrays!$G$3:$G$58,0)),IF(ISNA(MATCH(J27,Arrays!$H$3:$H$58,0)),\"NC\",\"CV\"),IF(EXACT(UPPER(J27),J27),\"C\",\"CV\")))","v":""},{"$f":"IF(AJ27=\"CV\",IF(ISNA(MATCH(J27,Arrays!$G$3:$G$58,0)),INDEX(Arrays!$G$3:$H$58,MATCH(J27,Arrays!$H$3:$H$58,0),1),UPPER(J27)),\"\")","v":""},{"$f":"IF(K27=\"\",\"\",LEN(SUM(MID(0&K27,LARGE(ISNUMBER(--MID(K27,ROW(INDIRECT(\"1:\"&LEN(K27))),1))* ROW(INDIRECT(\"1:\"&LEN(K27))),ROW(INDIRECT(\"1:\"&LEN(K27))))+1,1)*10^ROW(INDIRECT(\"1:\"&LEN(K27)))/10)))","v":""},"","",{"$f":"IF(AN27<>\"CV\",IF(AM27=\"CV\",LEFT(K27,5)&\"-\"&RIGHT(K27,4),\"\"),IF(LEN(K27)=5,TEXT(K27,\"#\"),IF(AN27=\"CV\",LEFT(K27,5)&\"-\"&RIGHT(K27,4),IF(AND(LEN(K27)=3,(COUNTIFS(Arrays!$I$3:$I$7,'Data Entry Worksheet'!J29,Arrays!$K$3:$K$7,LEFT(K27,1))+COUNTIFS(Arrays!$J$3:$J$7,'Data Entry Worksheet'!J29,Arrays!$K$3:$K$7,LEFT(K27,1)))>0),\"00\"&TEXT(K27,\"#\"),IF(AND(LEN(K27)=4,(COUNTIFS(Arrays!$M$3:$M$13,'Data Entry Worksheet'!J29,Arrays!$O$3:$O$13,LEFT(K27,1))+COUNTIFS(Arrays!$N$3:$N$13,'Data Entry Worksheet'!J29,Arrays!$O$3:$O$13,LEFT(K27,1)))>0),\"0\"&TEXT(K27,\"#\"),\"\")))))","v":""},{"$f":"IF(L27=\"\",\"\",IF(ISNA(MATCH(L27,Arrays!$G$3:$G$58,0)),IF(ISNA(MATCH(L27,Arrays!$H$3:$H$58,0)),\"NC\",\"CV\"),IF(EXACT(UPPER(L27),L27),\"C\",\"CV\")))","v":""},{"$f":"IF(AP27=\"CV\",IF(ISNA(MATCH(L27,Arrays!$G$3:$G$58,0)),INDEX(Arrays!$G$3:$H$58,MATCH(L27,Arrays!$H$3:$H$58,0),1),UPPER(L27)),\"\")","v":""},"","","","","",{"$f":"IF(O27=\"\",\"\",IF(ISNA(MATCH(O27,Arrays!$G$60:$G$65,0)),\"NC\",IF(EXACT(UPPER(O27),O27),\"C\",\"CV\")))","v":""},""]
[{"$f":"IF(COUNTIF(D28:O28,\"\")<>12,ROW()-17,IF(COUNT(INDIRECT(ADDRESS(ROW()+1,COLUMN(),4)&\":A50000\"))>0,ROW()-17,\"\"))","v":""},{"$f":"IF(A28<>\"\",D$3,\"\")","v":""},{"$f":"IF(B28<>\"\",D$5,\"\")","v":""},null,null,null,null,null,null,null,null,null,null,null,null,"","",{"$f":"IF(COUNTIF(T28:AX28,\"NC\")>0,\"Error\"&IF(COUNTIF(T28:AX28,\"CV\")>0,\"/Format\",\"\"),IF(COUNTIF(T28:AX28,\"CV\")>0,\"Format\",\"\"))","v":""},null,{"$f":"IF(AND(ISERR(FIND(\"*\",D28)),ISERR(FIND(\"<\",D28)),ISERR(FIND(\">\",D28)),ISERR(FIND(\"\\\",D28)),ISERR(FIND(\"/\",D28)),ISERR(FIND(\"%\",D28)),ISERR(FIND(\"^\",D28)),ISERR(FIND(\"`\",D28)),ISERR(FIND(\"{\",D28)),ISERR(FIND(\"}\",D28)),ISERR(FIND(\"~\",D28)),ISERR(FIND(\"[\",D28)),ISERR(FIND(\"]\",D28)),ISERR(FIND(\"!\",D28)),ISERR(FIND(\"&\",D28)),ISERR(FIND(\"+\",D28)),ISERR(FIND(\"=\",D28)),ISERR(FIND(\"?\",D28)),ISERR(FIND(\"#\",D28)),ISERR(FIND(CHAR(34),D28))),\"\",\"CV\")","v":""},{"$f":"IF(T28=\"CV\",SUBSTITUTE(SUBSTITUTE(SUBSTITUTE(SUBSTITUTE(SUBSTITUTE(SUBSTITUTE(SUBSTITUTE(SUBSTITUTE(SUBSTITUTE(SUBSTITUTE(SUBSTITUTE(SUBSTITUTE(SUBSTITUTE(SUBSTITUTE(SUBSTITUTE(SUBSTITUTE(SUBSTITUTE(SUBSTITUTE(SUBSTITUTE(SUBSTITUTE(D28,\"*\",\"\"),\"<\",\"\"),\">\",\"\"),\"\\\",\"\"),\"/\",\"\"),\"%\",\"\"),\"^\",\"\"),\"`\",\"\"),\"{\",\"\"),\"}\",\"\"),\"~\",\"\"),\"[\",\"\"),\"]\",\"\"),\"!\",\"\"),\"&\",\"\"),\"+\",\"\"),\"=\",\"\"),\"?\",\"\"),\"#\",\"\"),CHAR(34),\"\"),\"\")","v":""},{"$f":"IF(LEN(D28)>150,\"NC\",\"\")","v":""},{"$f":"IF(E28<>\"\",LEN(SUM(MID(0&E28,LARGE(ISNUMBER(--MID(E28,ROW(INDIRECT(\"1:\"&LEN(E28))),1))* ROW(INDIRECT(\"1:\"&LEN(E28))),ROW(INDIRECT(\"1:\"&LEN(E28))))+1,1)*10^ROW(INDIRECT(\"1:\"&LEN(E28)))/10)),\"\")","v":""},"",{"$f":"IF(X28=\"CV\",LEFT(E28,2)&\"-\"&RIGHT(E28,7),\"\")","v":""},{"$f":"IF(F28=\"\",\"\",IF(F28=\"Nonprofit\",IF(EXACT(UPPER(LEFT(F28,1)),LEFT(F28,1)),\"C\",\"CV\"),IF(F28=\"For Profit\",IF(AND(EXACT(UPPER(LEFT(F28,1)),LEFT(F28,1)),EXACT(UPPER(MID(F28,5,1)),MID(F28,5,1))),\"C\",\"CV\"),\"NC\")))","v":""},{"$f":"IF(AND(ISERR(FIND(\"*\",G28)),ISERR(FIND(\"<\",G28)),ISERR(FIND(\">\",G28)),ISERR(FIND(\"\\\",G28)),ISERR(FIND(\"/\",G28)),ISERR(FIND(\"%\",G28)),ISERR(FIND(\"^\",G28)),ISERR(FIND(\"`\",G28)),ISERR(FIND(\"{\",G28)),ISERR(FIND(\"}\",G28)),ISERR(FIND(\"~\",G28)),ISERR(FIND(\"[\",G28)),ISERR(FIND(\"]\",G28)),ISERR(FIND(\"!\",G28)),ISERR(FIND(\"&\",G28)),ISERR(FIND(\"+\",G28)),ISERR(FIND(\"=\",G28)),ISERR(FIND(\"?\",G28)),ISERR(FIND(\"#\",G28)),ISERR(FIND(CHAR(34),G28))),\"\",\"CV\")","v":""},{"$f":"IF(AA28=\"CV\",SUBSTITUTE(SUBSTITUTE(SUBSTITUTE(SUBSTITUTE(SUBSTITUTE(SUBSTITUTE(SUBSTITUTE(SUBSTITUTE(SUBSTITUTE(SUBSTITUTE(SUBSTITUTE(SUBSTITUTE(SUBSTITUTE(SUBSTITUTE(SUBSTITUTE(SUBSTITUTE(SUBSTITUTE(SUBSTITUTE(SUBSTITUTE(SUBSTITUTE(G28,\"*\",\"\"),\"<\",\"\"),\">\",\"\"),\"\\\",\"\"),\"/\",\"\"),\"%\",\"\"),\"^\",\"\"),\"`\",\"\"),\"{\",\"\"),\"}\",\"\"),\"~\",\"\"),\"[\",\"\"),\"]\",\"\"),\"!\",\"\"),\"&\",\"\"),\"+\",\"\"),\"=\",\"\"),\"?\",\"\"),\"#\",\"\"),CHAR(34),\"\"),\"\")","v":""},{"$f":"IF(LEN(G28)>150,\"NC\",\"\")","v":""},{"$f":"IF(AND(ISERR(FIND(\"*\",H28)),ISERR(FIND(\"<\",H28)),ISERR(FIND(\">\",H28)),ISERR(FIND(\"\\\",H28)),ISERR(FIND(\"/\",H28)),ISERR(FIND(\"%\",H28)),ISERR(FIND(\"^\",H28)),ISERR(FIND(\"`\",H28)),ISERR(FIND(\"{\",H28)),ISERR(FIND(\"}\",H28)),ISERR(FIND(\"~\",H28)),ISERR(FIND(\"[\",H28)),ISERR(FIND(\"]\",H28)),ISERR(FIND(\"!\",H28)),ISERR(FIND(\"&\",H28)),ISERR(FIND(\"+\",H28)),ISERR(FIND(\"=\",H28)),ISERR(FIND(\"?\",H28)),ISERR(FIND(\"#\",H28)),ISERR(FIND(CHAR(34),H28))),\"\",\"CV\")","v":""},{"$f":"IF(AD28=\"CV\",SUBSTITUTE(SUBSTITUTE(SUBSTITUTE(SUBSTITUTE(SUBSTITUTE(SUBSTITUTE(SUBSTITUTE(SUBSTITUTE(SUBSTITUTE(SUBSTITUTE(SUBSTITUTE(SUBSTITUTE(SUBSTITUTE(SUBSTITUTE(SUBSTITUTE(SUBSTITUTE(SUBSTITUTE(SUBSTITUTE(SUBSTITUTE(SUBSTITUTE(H28,\"*\",\"\"),\"<\",\"\"),\">\",\"\"),\"\\\",\"\"),\"/\",\"\"),\"%\",\"\"),\"^\",\"\"),\"`\",\"\"),\"{\",\"\"),\"}\",\"\"),\"~\",\"\"),\"[\",\"\"),\"]\",\"\"),\"!\",\"\"),\"&\",\"\"),\"+\",\"\"),\"=\",\"\"),\"?\",\"\"),\"#\",\"\"),CHAR(34),\"\"),\"\")","v":""},{"$f":"IF(LEN(H28)>150,\"NC\",\"\")","v":""},{"$f":"IF(AND(ISERR(FIND(\"*\",I28)),ISERR(FIND(\"<\",I28)),ISERR(FIND(\">\",I28)),ISERR(FIND(\"\\\",I28)),ISERR(FIND(\"/\",I28)),ISERR(FIND(\"%\",I28)),ISERR(FIND(\"^\",I28)),ISERR(FIND(\"`\",I28)),ISERR(FIND(\"{\",I28)),ISERR(FIND(\"}\",I28)),ISERR(FIND(\"~\",I28)),ISERR(FIND(\"[\",I28)),ISERR(FIND(\"]\",I28)),ISERR(FIND(\"!\",I28)),ISERR(FIND(\"&\",I28)),ISERR(FIND(\"+\",I28)),ISERR(FIND(\"=\",I28)),ISERR(FIND(\"?\",I28)),ISERR(FIND(\"#\",I28)),ISERR(FIND(CHAR(34),I28))),\"\",\"CV\")","v":""},{"$f":"IF(AG28=\"CV\",SUBSTITUTE(SUBSTITUTE(SUBSTITUTE(SUBSTITUTE(SUBSTITUTE(SUBSTITUTE(SUBSTITUTE(SUBSTITUTE(SUBSTITUTE(SUBSTITUTE(SUBSTITUTE(SUBSTITUTE(SUBSTITUTE(SUBSTITUTE(SUBSTITUTE(SUBSTITUTE(SUBSTITUTE(SUBSTITUTE(SUBSTITUTE(SUBSTITUTE(I28,\"*\",\"\"),\"<\",\"\"),\">\",\"\"),\"\\\",\"\"),\"/\",\"\"),\"%\",\"\"),\"^\",\"\"),\"`\",\"\"),\"{\",\"\"),\"}\",\"\"),\"~\",\"\"),\"[\",\"\"),\"]\",\"\"),\"!\",\"\"),\"&\",\"\"),\"+\",\"\"),\"=\",\"\"),\"?\",\"\"),\"#\",\"\"),CHAR(34),\"\"),\"\")","v":""},{"$f":"IF(LEN(I28)>150,\"NC\",\"\")","v":""},{"$f":"IF(J28=\"\",\"\",IF(ISNA(MATCH(J28,Arrays!$G$3:$G$58,0)),IF(ISNA(MATCH(J28,Arrays!$H$3:$H$58,0)),\"NC\",\"CV\"),IF(EXACT(UPPER(J28),J28),\"C\",\"CV\")))","v":""},{"$f":"IF(AJ28=\"CV\",IF(ISNA(MATCH(J28,Arrays!$G$3:$G$58,0)),INDEX(Arrays!$G$3:$H$58,MATCH(J28,Arrays!$H$3:$H$58,0),1),UPPER(J28)),\"\")","v":""},{"$f":"IF(K28=\"\",\"\",LEN(SUM(MID(0&K28,LARGE(ISNUMBER(--MID(K28,ROW(INDIRECT(\"1:\"&LEN(K28))),1))* ROW(INDIRECT(\"1:\"&LEN(K28))),ROW(INDIRECT(\"1:\"&LEN(K28))))+1,1)*10^ROW(INDIRECT(\"1:\"&LEN(K28)))/10)))","v":""},{"$f":"IF(K28=\"\",\"\",IF(OR(AND(AL28=5,LEN(K28)=5),AND(AL28=9,LEN(K28)=10,MID(K28,6,1)=\"-\"),AND(AL28=4,LEN(K28)=5,LEFT(K28,1)=\"0\"),AND(AL28=8,LEN(K28)=10,MID(K28,6,1)=\"-\",LEFT(K28,1)=\"0\")),\"C\",IF(OR(AND(AL28=9,LEN(K28)=9),AND(AL28=8,LEN(K28)=9,LEFT(K28,1)=\"0\")),\"CV\",\"NC\")))","v":""},"",{"$f":"IF(AN28<>\"CV\",IF(AM28=\"CV\",LEFT(K28,5)&\"-\"&RIGHT(K28,4),\"\"),IF(LEN(K28)=5,TEXT(K28,\"#\"),IF(AN28=\"CV\",LEFT(K28,5)&\"-\"&RIGHT(K28,4),IF(AND(LEN(K28)=3,(COUNTIFS(Arrays!$I$3:$I$7,'Data Entry Worksheet'!J30,Arrays!$K$3:$K$7,LEFT(K28,1))+COUNTIFS(Arrays!$J$3:$J$7,'Data Entry Worksheet'!J30,Arrays!$K$3:$K$7,LEFT(K28,1)))>0),\"00\"&TEXT(K28,\"#\"),IF(AND(LEN(K28)=4,(COUNTIFS(Arrays!$M$3:$M$13,'Data Entry Worksheet'!J30,Arrays!$O$3:$O$13,LEFT(K28,1))+COUNTIFS(Arrays!$N$3:$N$13,'Data Entry Worksheet'!J30,Arrays!$O$3:$O$13,LEFT(K28,1)))>0),\"0\"&TEXT(K28,\"#\"),\"\")))))","v":""},{"$f":"IF(L28=\"\",\"\",IF(ISNA(MATCH(L28,Arrays!$G$3:$G$58,0)),IF(ISNA(MATCH(L28,Arrays!$H$3:$H$58,0)),\"NC\",\"CV\"),IF(EXACT(UPPER(L28),L28),\"C\",\"CV\")))","v":""},{"$f":"IF(AP28=\"CV\",IF(ISNA(MATCH(L28,Arrays!$G$3:$G$58,0)),INDEX(Arrays!$G$3:$H$58,MATCH(L28,Arrays!$H$3:$H$58,0),1),UPPER(L28)),\"\")","v":""},"",{"$f":"IF(OR(F28=\"C\",F28=\"\"),\"\",IF(F28=\"nonprofit\",\"Nonprofit\",\"For Profit\"))","v":""},{"$f":"IF(AS28=\"CV\",TEXT(M28,\"##\"),\"\")","v":""},"","",{"$f":"IF(O28=\"\",\"\",IF(ISNA(MATCH(O28,Arrays!$G$60:$G$65,0)),\"NC\",IF(EXACT(UPPER(O28),O28),\"C\",\"CV\")))","v":""},{"$f":"IF(AW28=\"\",\"\",UPPER(O28))","v":""}]
[{"$f":"IF(COUNTIF(D29:O29,\"\")<>12,ROW()-17,IF(COUNT(INDIRECT(ADDRESS(ROW()+1,COLUMN(),4)&\":A50000\"))>0,ROW()-17,\"\"))","v":""},{"$f":"IF(A29<>\"\",D$3,\"\")","v":""},{"$f":"IF(B29<>\"\",D$5,\"\")","v":""},null,null,null,null,null,null,null,null,null,null,null,null,"","",{"$f":"IF(COUNTIF(T29:AX29,\"NC\")>0,\"Error\"&IF(COUNTIF(T29:AX29,\"CV\")>0,\"/Format\",\"\"),IF(COUNTIF(T29:AX29,\"CV\")>0,\"Format\",\"\"))","v":""},null,{"$f":"IF(AND(ISERR(FIND(\"*\",D29)),ISERR(FIND(\"<\",D29)),ISERR(FIND(\">\",D29)),ISERR(FIND(\"\\\",D29)),ISERR(FIND(\"/\",D29)),ISERR(FIND(\"%\",D29)),ISERR(FIND(\"^\",D29)),ISERR(FIND(\"`\",D29)),ISERR(FIND(\"{\",D29)),ISERR(FIND(\"}\",D29)),ISERR(FIND(\"~\",D29)),ISERR(FIND(\"[\",D29)),ISERR(FIND(\"]\",D29)),ISERR(FIND(\"!\",D29)),ISERR(FIND(\"&\",D29)),ISERR(FIND(\"+\",D29)),ISERR(FIND(\"=\",D29)),ISERR(FIND(\"?\",D29)),ISERR(FIND(\"#\",D29)),ISERR(FIND(CHAR(34),D29))),\"\",\"CV\")","v":""},{"$f":"IF(T29=\"CV\",SUBSTITUTE(SUBSTITUTE(SUBSTITUTE(SUBSTITUTE(SUBSTITUTE(SUBSTITUTE(SUBSTITUTE(SUBSTITUTE(SUBSTITUTE(SUBSTITUTE(SUBSTITUTE(SUBSTITUTE(SUBSTITUTE(SUBSTITUTE(SUBSTITUTE(SUBSTITUTE(SUBSTITUTE(SUBSTITUTE(SUBSTITUTE(SUBSTITUTE(D29,\"*\",\"\"),\"<\",\"\"),\">\",\"\"),\"\\\",\"\"),\"/\",\"\"),\"%\",\"\"),\"^\",\"\"),\"`\",\"\"),\"{\",\"\"),\"}\",\"\"),\"~\",\"\"),\"[\",\"\"),\"]\",\"\"),\"!\",\"\"),\"&\",\"\"),\"+\",\"\"),\"=\",\"\"),\"?\",\"\"),\"#\",\"\"),CHAR(34),\"\"),\"\")","v":""},{"$f":"IF(LEN(D29)>150,\"NC\",\"\")","v":""},{"$f":"IF(E29<>\"\",LEN(SUM(MID(0&E29,LARGE(ISNUMBER(--MID(E29,ROW(INDIRECT(\"1:\"&LEN(E29))),1))* ROW(INDIRECT(\"1:\"&LEN(E29))),ROW(INDIRECT(\"1:\"&LEN(E29))))+1,1)*10^ROW(INDIRECT(\"1:\"&LEN(E29)))/10)),\"\")","v":""},"",{"$f":"IF(X29=\"CV\",LEFT(E29,2)&\"-\"&RIGHT(E29,7),\"\")","v":""},{"$f":"IF(F29=\"\",\"\",IF(F29=\"Nonprofit\",IF(EXACT(UPPER(LEFT(F29,1)),LEFT(F29,1)),\"C\",\"CV\"),IF(F29=\"For Profit\",IF(AND(EXACT(UPPER(LEFT(F29,1)),LEFT(F29,1)),EXACT(UPPER(MID(F29,5,1)),MID(F29,5,1))),\"C\",\"CV\"),\"NC\")))","v":""},{"$f":"IF(AND(ISERR(FIND(\"*\",G29)),ISERR(FIND(\"<\",G29)),ISERR(FIND(\">\",G29)),ISERR(FIND(\"\\\",G29)),ISERR(FIND(\"/\",G29)),ISERR(FIND(\"%\",G29)),ISERR(FIND(\"^\",G29)),ISERR(FIND(\"`\",G29)),ISERR(FIND(\"{\",G29)),ISERR(FIND(\"}\",G29)),ISERR(FIND(\"~\",G29)),ISERR(FIND(\"[\",G29)),ISERR(FIND(\"]\",G29)),ISERR(FIND(\"!\",G29)),ISERR(FIND(\"&\",G29)),ISERR(FIND(\"+\",G29)),ISERR(FIND(\"=\",G29)),ISERR(FIND(\"?\",G29)),ISERR(FIND(\"#\",G29)),ISERR(FIND(CHAR(34),G29))),\"\",\"CV\")","v":""},{"$f":"IF(AA29=\"CV\",SUBSTITUTE(SUBSTITUTE(SUBSTITUTE(SUBSTITUTE(SUBSTITUTE(SUBSTITUTE(SUBSTITUTE(SUBSTITUTE(SUBSTITUTE(SUBSTITUTE(SUBSTITUTE(SUBSTITUTE(SUBSTITUTE(SUBSTITUTE(SUBSTITUTE(SUBSTITUTE(SUBSTITUTE(SUBSTITUTE(SUBSTITUTE(SUBSTITUTE(G29,\"*\",\"\"),\"<\",\"\"),\">\",\"\"),\"\\\",\"\"),\"/\",\"\"),\"%\",\"\"),\"^\",\"\"),\"`\",\"\"),\"{\",\"\"),\"}\",\"\"),\"~\",\"\"),\"[\",\"\"),\"]\",\"\"),\"!\",\"\"),\"&\",\"\"),\"+\",\"\"),\"=\",\"\"),\"?\",\"\"),\"#\",\"\"),CHAR(34),\"\"),\"\")","v":""},{"$f":"IF(LEN(G29)>150,\"NC\",\"\")","v":""},{"$f":"IF(AND(ISERR(FIND(\"*\",H29)),ISERR(FIND(\"<\",H29)),ISERR(FIND(\">\",H29)),ISERR(FIND(\"\\\",H29)),ISERR(FIND(\"/\",H29)),ISERR(FIND(\"%\",H29)),ISERR(FIND(\"^\",H29)),ISERR(FIND(\"`\",H29)),ISERR(FIND(\"{\",H29)),ISERR(FIND(\"}\",H29)),ISERR(FIND(\"~\",H29)),ISERR(FIND(\"[\",H29)),ISERR(FIND(\"]\",H29)),ISERR(FIND(\"!\",H29)),ISERR(FIND(\"&\",H29)),ISERR(FIND(\"+\",H29)),ISERR(FIND(\"=\",H29)),ISERR(FIND(\"?\",H29)),ISERR(FIND(\"#\",H29)),ISERR(FIND(CHAR(34),H29))),\"\",\"CV\")","v":""},{"$f":"IF(AD29=\"CV\",SUBSTITUTE(SUBSTITUTE(SUBSTITUTE(SUBSTITUTE(SUBSTITUTE(SUBSTITUTE(SUBSTITUTE(SUBSTITUTE(SUBSTITUTE(SUBSTITUTE(SUBSTITUTE(SUBSTITUTE(SUBSTITUTE(SUBSTITUTE(SUBSTITUTE(SUBSTITUTE(SUBSTITUTE(SUBSTITUTE(SUBSTITUTE(SUBSTITUTE(H29,\"*\",\"\"),\"<\",\"\"),\">\",\"\"),\"\\\",\"\"),\"/\",\"\"),\"%\",\"\"),\"^\",\"\"),\"`\",\"\"),\"{\",\"\"),\"}\",\"\"),\"~\",\"\"),\"[\",\"\"),\"]\",\"\"),\"!\",\"\"),\"&\",\"\"),\"+\",\"\"),\"=\",\"\"),\"?\",\"\"),\"#\",\"\"),CHAR(34),\"\"),\"\")","v":""},{"$f":"IF(LEN(H29)>150,\"NC\",\"\")","v":""},{"$f":"IF(AND(ISERR(FIND(\"*\",I29)),ISERR(FIND(\"<\",I29)),ISERR(FIND(\">\",I29)),ISERR(FIND(\"\\\",I29)),ISERR(FIND(\"/\",I29)),ISERR(FIND(\"%\",I29)),ISERR(FIND(\"^\",I29)),ISERR(FIND(\"`\",I29)),ISERR(FIND(\"{\",I29)),ISERR(FIND(\"}\",I29)),ISERR(FIND(\"~\",I29)),ISERR(FIND(\"[\",I29)),ISERR(FIND(\"]\",I29)),ISERR(FIND(\"!\",I29)),ISERR(FIND(\"&\",I29)),ISERR(FIND(\"+\",I29)),ISERR(FIND(\"=\",I29)),ISERR(FIND(\"?\",I29)),ISERR(FIND(\"#\",I29)),ISERR(FIND(CHAR(34),I29))),\"\",\"CV\")","v":""},{"$f":"IF(AG29=\"CV\",SUBSTITUTE(SUBSTITUTE(SUBSTITUTE(SUBSTITUTE(SUBSTITUTE(SUBSTITUTE(SUBSTITUTE(SUBSTITUTE(SUBSTITUTE(SUBSTITUTE(SUBSTITUTE(SUBSTITUTE(SUBSTITUTE(SUBSTITUTE(SUBSTITUTE(SUBSTITUTE(SUBSTITUTE(SUBSTITUTE(SUBSTITUTE(SUBSTITUTE(I29,\"*\",\"\"),\"<\",\"\"),\">\",\"\"),\"\\\",\"\"),\"/\",\"\"),\"%\",\"\"),\"^\",\"\"),\"`\",\"\"),\"{\",\"\"),\"}\",\"\"),\"~\",\"\"),\"[\",\"\"),\"]\",\"\"),\"!\",\"\"),\"&\",\"\"),\"+\",\"\"),\"=\",\"\"),\"?\",\"\"),\"#\",\"\"),CHAR(34),\"\"),\"\")","v":""},{"$f":"IF(LEN(I29)>150,\"NC\",\"\")","v":""},{"$f":"IF(J29=\"\",\"\",IF(ISNA(MATCH(J29,Arrays!$G$3:$G$58,0)),IF(ISNA(MATCH(J29,Arrays!$H$3:$H$58,0)),\"NC\",\"CV\"),IF(EXACT(UPPER(J29),J29),\"C\",\"CV\")))","v":""},{"$f":"IF(AJ29=\"CV\",IF(ISNA(MATCH(J29,Arrays!$G$3:$G$58,0)),INDEX(Arrays!$G$3:$H$58,MATCH(J29,Arrays!$H$3:$H$58,0),1),UPPER(J29)),\"\")","v":""},{"$f":"IF(K29=\"\",\"\",LEN(SUM(MID(0&K29,LARGE(ISNUMBER(--MID(K29,ROW(INDIRECT(\"1:\"&LEN(K29))),1))* ROW(INDIRECT(\"1:\"&LEN(K29))),ROW(INDIRECT(\"1:\"&LEN(K29))))+1,1)*10^ROW(INDIRECT(\"1:\"&LEN(K29)))/10)))","v":""},{"$f":"IF(K29=\"\",\"\",IF(OR(AND(AL29=5,LEN(K29)=5),AND(AL29=9,LEN(K29)=10,MID(K29,6,1)=\"-\"),AND(AL29=4,LEN(K29)=5,LEFT(K29,1)=\"0\"),AND(AL29=8,LEN(K29)=10,MID(K29,6,1)=\"-\",LEFT(K29,1)=\"0\")),\"C\",IF(OR(AND(AL29=9,LEN(K29)=9),AND(AL29=8,LEN(K29)=9,LEFT(K29,1)=\"0\")),\"CV\",\"NC\")))","v":""},"",{"$f":"IF(AN29<>\"CV\",IF(AM29=\"CV\",LEFT(K29,5)&\"-\"&RIGHT(K29,4),\"\"),IF(LEN(K29)=5,TEXT(K29,\"#\"),IF(AN29=\"CV\",LEFT(K29,5)&\"-\"&RIGHT(K29,4),IF(AND(LEN(K29)=3,(COUNTIFS(Arrays!$I$3:$I$7,'Data Entry Worksheet'!#REF!,Arrays!$K$3:$K$7,LEFT(K29,1))+COUNTIFS(Arrays!$J$3:$J$7,'Data Entry Worksheet'!#REF!,Arrays!$K$3:$K$7,LEFT(K29,1)))>0),\"00\"&TEXT(K29,\"#\"),IF(AND(LEN(K29)=4,(COUNTIFS(Arrays!$M$3:$M$13,'Data Entry Worksheet'!#REF!,Arrays!$O$3:$O$13,LEFT(K29,1))+COUNTIFS(Arrays!$N$3:$N$13,'Data Entry Worksheet'!#REF!,Arrays!$O$3:$O$13,LEFT(K29,1)))>0),\"0\"&TEXT(K29,\"#\"),\"\")))))","v":""},{"$f":"IF(L29=\"\",\"\",IF(ISNA(MATCH(L29,Arrays!$G$3:$G$58,0)),IF(ISNA(MATCH(L29,Arrays!$H$3:$H$58,0)),\"NC\",\"CV\"),IF(EXACT(UPPER(L29),L29),\"C\",\"CV\")))","v":""},{"$f":"IF(AP29=\"CV\",IF(ISNA(MATCH(L29,Arrays!$G$3:$G$58,0)),INDEX(Arrays!$G$3:$H$58,MATCH(L29,Arrays!$H$3:$H$58,0),1),UPPER(L29)),\"\")","v":""},"",{"$f":"IF(OR(F29=\"C\",F29=\"\"),\"\",IF(F29=\"nonprofit\",\"Nonprofit\",\"For Profit\"))","v":""},{"$f":"IF(AS29=\"CV\",TEXT(M29,\"##\"),\"\")","v":""},"","",{"$f":"IF(O29=\"\",\"\",IF(ISNA(MATCH(O29,Arrays!$G$60:$G$65,0)),\"NC\",IF(EXACT(UPPER(O29),O29),\"C\",\"CV\")))","v":""},{"$f":"IF(AW29=\"\",\"\",UPPER(O29))","v":""}]
[{"$f":"IF(COUNTIF(D30:O30,\"\")<>12,ROW()-17,IF(COUNT(INDIRECT(ADDRESS(ROW()+1,COLUMN(),4)&\":A50000\"))>0,ROW()-17,\"\"))","v":""},{"$f":"IF(A30<>\"\",D$3,\"\")","v":""},{"$f":"IF(B30<>\"\",D$5,\"\")","v":""},null,null,null,null,null,null,null,null,null,null,null,null,"","",{"$f":"IF(COUNTIF(T30:AX30,\"NC\")>0,\"Error\"&IF(COUNTIF(T30:AX30,\"CV\")>0,\"/Format\",\"\"),IF(COUNTIF(T30:AX30,\"CV\")>0,\"Format\",\"\"))","v":""},null,{"$f":"IF(AND(ISERR(FIND(\"*\",D30)),ISERR(FIND(\"<\",D30)),ISERR(FIND(\">\",D30)),ISERR(FIND(\"\\\",D30)),ISERR(FIND(\"/\",D30)),ISERR(FIND(\"%\",D30)),ISERR(FIND(\"^\",D30)),ISERR(FIND(\"`\",D30)),ISERR(FIND(\"{\",D30)),ISERR(FIND(\"}\",D30)),ISERR(FIND(\"~\",D30)),ISERR(FIND(\"[\",D30)),ISERR(FIND(\"]\",D30)),ISERR(FIND(\"!\",D30)),ISERR(FIND(\"&\",D30)),ISERR(FIND(\"+\",D30)),ISERR(FIND(\"=\",D30)),ISERR(FIND(\"?\",D30)),ISERR(FIND(\"#\",D30)),ISERR(FIND(CHAR(34),D30))),\"\",\"CV\")","v":""},{"$f":"IF(T30=\"CV\",SUBSTITUTE(SUBSTITUTE(SUBSTITUTE(SUBSTITUTE(SUBSTITUTE(SUBSTITUTE(SUBSTITUTE(SUBSTITUTE(SUBSTITUTE(SUBSTITUTE(SUBSTITUTE(SUBSTITUTE(SUBSTITUTE(SUBSTITUTE(SUBSTITUTE(SUBSTITUTE(SUBSTITUTE(SUBSTITUTE(SUBSTITUTE(SUBSTITUTE(D30,\"*\",\"\"),\"<\",\"\"),\">\",\"\"),\"\\\",\"\"),\"/\",\"\"),\"%\",\"\"),\"^\",\"\"),\"`\",\"\"),\"{\",\"\"),\"}\",\"\"),\"~\",\"\"),\"[\",\"\"),\"]\",\"\"),\"!\",\"\"),\"&\",\"\"),\"+\",\"\"),\"=\",\"\"),\"?\",\"\"),\"#\",\"\"),CHAR(34),\"\"),\"\")","v":""},{"$f":"IF(LEN(D30)>150,\"NC\",\"\")","v":""},{"$f":"IF(E30<>\"\",LEN(SUM(MID(0&E30,LARGE(ISNUMBER(--MID(E30,ROW(INDIRECT(\"1:\"&LEN(E30))),1))* ROW(INDIRECT(\"1:\"&LEN(E30))),ROW(INDIRECT(\"1:\"&LEN(E30))))+1,1)*10^ROW(INDIRECT(\"1:\"&LEN(E30)))/10)),\"\")","v":""},"",{"$f":"IF(X30=\"CV\",LEFT(E30,2)&\"-\"&RIGHT(E30,7),\"\")","v":""},{"$f":"IF(F30=\"\",\"\",IF(F30=\"Nonprofit\",IF(EXACT(UPPER(LEFT(F30,1)),LEFT(F30,1)),\"C\",\"CV\"),IF(F30=\"For Profit\",IF(AND(EXACT(UPPER(LEFT(F30,1)),LEFT(F30,1)),EXACT(UPPER(MID(F30,5,1)),MID(F30,5,1))),\"C\",\"CV\"),\"NC\")))","v":""},{"$f":"IF(AND(ISERR(FIND(\"*\",G30)),ISERR(FIND(\"<\",G30)),ISERR(FIND(\">\",G30)),ISERR(FIND(\"\\\",G30)),ISERR(FIND(\"/\",G30)),ISERR(FIND(\"%\",G30)),ISERR(FIND(\"^\",G30)),ISERR(FIND(\"`\",G30)),ISERR(FIND(\"{\",G30)),ISERR(FIND(\"}\",G30)),ISERR(FIND(\"~\",G30)),ISERR(FIND(\"[\",G30)),ISERR(FIND(\"]\",G30)),ISERR(FIND(\"!\",G30)),ISERR(FIND(\"&\",G30)),ISERR(FIND(\"+\",G30)),ISERR(FIND(\"=\",G30)),ISERR(FIND(\"?\",G30)),ISERR(FIND(\"#\",G30)),ISERR(FIND(CHAR(34),G30))),\"\",\"CV\")","v":""},{"$f":"IF(AA30=\"CV\",SUBSTITUTE(SUBSTITUTE(SUBSTITUTE(SUBSTITUTE(SUBSTITUTE(SUBSTITUTE(SUBSTITUTE(SUBSTITUTE(SUBSTITUTE(SUBSTITUTE(SUBSTITUTE(SUBSTITUTE(SUBSTITUTE(SUBSTITUTE(SUBSTITUTE(SUBSTITUTE(SUBSTITUTE(SUBSTITUTE(SUBSTITUTE(SUBSTITUTE(G30,\"*\",\"\"),\"<\",\"\"),\">\",\"\"),\"\\\",\"\"),\"/\",\"\"),\"%\",\"\"),\"^\",\"\"),\"`\",\"\"),\"{\",\"\"),\"}\",\"\"),\"~\",\"\"),\"[\",\"\"),\"]\",\"\"),\"!\",\"\"),\"&\",\"\"),\"+\",\"\"),\"=\",\"\"),\"?\",\"\"),\"#\",\"\"),CHAR(34),\"\"),\"\")","v":""},{"$f":"IF(LEN(G30)>150,\"NC\",\"\")","v":""},{"$f":"IF(AND(ISERR(FIND(\"*\",H30)),ISERR(FIND(\"<\",H30)),ISERR(FIND(\">\",H30)),ISERR(FIND(\"\\\",H30)),ISERR(FIND(\"/\",H30)),ISERR(FIND(\"%\",H30)),ISERR(FIND(\"^\",H30)),ISERR(FIND(\"`\",H30)),ISERR(FIND(\"{\",H30)),ISERR(FIND(\"}\",H30)),ISERR(FIND(\"~\",H30)),ISERR(FIND(\"[\",H30)),ISERR(FIND(\"]\",H30)),ISERR(FIND(\"!\",H30)),ISERR(FIND(\"&\",H30)),ISERR(FIND(\"+\",H30)),ISERR(FIND(\"=\",H30)),ISERR(FIND(\"?\",H30)),ISERR(FIND(\"#\",H30)),ISERR(FIND(CHAR(34),H30))),\"\",\"CV\")","v":""},{"$f":"IF(AD30=\"CV\",SUBSTITUTE(SUBSTITUTE(SUBSTITUTE(SUBSTITUTE(SUBSTITUTE(SUBSTITUTE(SUBSTITUTE(SUBSTITUTE(SUBSTITUTE(SUBSTITUTE(SUBSTITUTE(SUBSTITUTE(SUBSTITUTE(SUBSTITUTE(SUBSTITUTE(SUBSTITUTE(SUBSTITUTE(SUBSTITUTE(SUBSTITUTE(SUBSTITUTE(H30,\"*\",\"\"),\"<\",\"\"),\">\",\"\"),\"\\\",\"\"),\"/\",\"\"),\"%\",\"\"),\"^\",\"\"),\"`\",\"\"),\"{\",\"\"),\"}\",\"\"),\"~\",\"\"),\"[\",\"\"),\"]\",\"\"),\"!\",\"\"),\"&\",\"\"),\"+\",\"\"),\"=\",\"\"),\"?\",\"\"),\"#\",\"\"),CHAR(34),\"\"),\"\")","v":""},{"$f":"IF(LEN(H30)>150,\"NC\",\"\")","v":""},{"$f":"IF(AND(ISERR(FIND(\"*\",I30)),ISERR(FIND(\"<\",I30)),ISERR(FIND(\">\",I30)),ISERR(FIND(\"\\\",I30)),ISERR(FIND(\"/\",I30)),ISERR(FIND(\"%\",I30)),ISERR(FIND(\"^\",I30)),ISERR(FIND(\"`\",I30)),ISERR(FIND(\"{\",I30)),ISERR(FIND(\"}\",I30)),ISERR(FIND(\"~\",I30)),ISERR(FIND(\"[\",I30)),ISERR(FIND(\"]\",I30)),ISERR(FIND(\"!\",I30)),ISERR(FIND(\"&\",I30)),ISERR(FIND(\"+\",I30)),ISERR(FIND(\"=\",I30)),ISERR(FIND(\"?\",I30)),ISERR(FIND(\"#\",I30)),ISERR(FIND(CHAR(34),I30))),\"\",\"CV\")","v":""},{"$f":"IF(AG30=\"CV\",SUBSTITUTE(SUBSTITUTE(SUBSTITUTE(SUBSTITUTE(SUBSTITUTE(SUBSTITUTE(SUBSTITUTE(SUBSTITUTE(SUBSTITUTE(SUBSTITUTE(SUBSTITUTE(SUBSTITUTE(SUBSTITUTE(SUBSTITUTE(SUBSTITUTE(SUBSTITUTE(SUBSTITUTE(SUBSTITUTE(SUBSTITUTE(SUBSTITUTE(I30,\"*\",\"\"),\"<\",\"\"),\">\",\"\"),\"\\\",\"\"),\"/\",\"\"),\"%\",\"\"),\"^\",\"\"),\"`\",\"\"),\"{\",\"\"),\"}\",\"\"),\"~\",\"\"),\"[\",\"\"),\"]\",\"\"),\"!\",\"\"),\"&\",\"\"),\"+\",\"\"),\"=\",\"\"),\"?\",\"\"),\"#\",\"\"),CHAR(34),\"\"),\"\")","v":""},{"$f":"IF(LEN(I30)>150,\"NC\",\"\")","v":""},{"$f":"IF(J30=\"\",\"\",IF(ISNA(MATCH(J30,Arrays!$G$3:$G$58,0)),IF(ISNA(MATCH(J30,Arrays!$H$3:$H$58,0)),\"NC\",\"CV\"),IF(EXACT(UPPER(J30),J30),\"C\",\"CV\")))","v":""},{"$f":"IF(AJ30=\"CV\",IF(ISNA(MATCH(J30,Arrays!$G$3:$G$58,0)),INDEX(Arrays!$G$3:$H$58,MATCH(J30,Arrays!$H$3:$H$58,0),1),UPPER(J30)),\"\")","v":""},{"$f":"IF(K30=\"\",\"\",LEN(SUM(MID(0&K30,LARGE(ISNUMBER(--MID(K30,ROW(INDIRECT(\"1:\"&LEN(K30))),1))* ROW(INDIRECT(\"1:\"&LEN(K30))),ROW(INDIRECT(\"1:\"&LEN(K30))))+1,1)*10^ROW(INDIRECT(\"1:\"&LEN(K30)))/10)))","v":""},{"$f":"IF(K30=\"\",\"\",IF(OR(AND(AL30=5,LEN(K30)=5),AND(AL30=9,LEN(K30)=10,MID(K30,6,1)=\"-\"),AND(AL30=4,LEN(K30)=5,LEFT(K30,1)=\"0\"),AND(AL30=8,LEN(K30)=10,MID(K30,6,1)=\"-\",LEFT(K30,1)=\"0\")),\"C\",IF(OR(AND(AL30=9,LEN(K30)=9),AND(AL30=8,LEN(K30)=9,LEFT(K30,1)=\"0\")),\"CV\",\"NC\")))","v":""},{"$f":"IF(K30=\"\",\"\",IF(ISTEXT(K30),\"\",TEXT(K30,\"##\")))","v":""},{"$f":"IF(AN30<>\"CV\",IF(AM30=\"CV\",LEFT(K30,5)&\"-\"&RIGHT(K30,4),\"\"),IF(LEN(K30)=5,TEXT(K30,\"#\"),IF(AN30=\"CV\",LEFT(K30,5)&\"-\"&RIGHT(K30,4),IF(AND(LEN(K30)=3,(COUNTIFS(Arrays!$I$3:$I$7,'Data Entry Worksheet'!#REF!,Arrays!$K$3:$K$7,LEFT(K30,1))+COUNTIFS(Arrays!$J$3:$J$7,'Data Entry Worksheet'!#REF!,Arrays!$K$3:$K$7,LEFT(K30,1)))>0),\"00\"&TEXT(K30,\"#\"),IF(AND(LEN(K30)=4,(COUNTIFS(Arrays!$M$3:$M$13,'Data Entry Worksheet'!#REF!,Arrays!$O$3:$O$13,LEFT(K30,1))+COUNTIFS(Arrays!$N$3:$N$13,'Data Entry Worksheet'!#REF!,Arrays!$O$3:$O$13,LEFT(K30,1)))>0),\"0\"&TEXT(K30,\"#\"),\"\")))))","v":""},{"$f":"IF(L30=\"\",\"\",IF(ISNA(MATCH(L30,Arrays!$G$3:$G$58,0)),IF(ISNA(MATCH(L30,Arrays!$H$3:$H$58,0)),\"NC\",\"CV\"),IF(EXACT(UPPER(L30),L30),\"C\",\"CV\")))","v":""},{"$f":"IF(AP30=\"CV\",IF(ISNA(MATCH(L30,Arrays!$G$3:$G$58,0)),INDEX(Arrays!$G$3:$H$58,MATCH(L30,Arrays!$H$3:$H$58,0),1),UPPER(L30)),\"\")","v":""},"",{"$f":"IF(OR(F30=\"C\",F30=\"\"),\"\",IF(F30=\"nonprofit\",\"Nonprofit\",\"For Profit\"))","v":""},{"$f":"IF(AS30=\"CV\",TEXT(M30,\"##\"),\"\")","v":""},"","",{"$f":"IF(O30=\"\",\"\",IF(ISNA(MATCH(O30,Arrays!$G$60:$G$65,0)),\"NC\",IF(EXACT(UPPER(O30),O30),\"C\",\"CV\")))","v":""},{"$f":"IF(AW30=\"\",\"\",UPPER(O30))","v":""}]
[{"$f":"IF(COUNTIF(D31:O31,\"\")<>12,ROW()-17,IF(COUNT(INDIRECT(ADDRESS(ROW()+1,COLUMN(),4)&\":A50000\"))>0,ROW()-17,\"\"))","v":""},{"$f":"IF(A31<>\"\",D$3,\"\")","v":""},{"$f":"IF(B31<>\"\",D$5,\"\")","v":""},null,null,null,null,null,null,null,null,null,null,null,null,"","",{"$f":"IF(COUNTIF(T31:AX31,\"NC\")>0,\"Error\"&IF(COUNTIF(T31:AX31,\"CV\")>0,\"/Format\",\"\"),IF(COUNTIF(T31:AX31,\"CV\")>0,\"Format\",\"\"))","v":""},null,{"$f":"IF(AND(ISERR(FIND(\"*\",D31)),ISERR(FIND(\"<\",D31)),ISERR(FIND(\">\",D31)),ISERR(FIND(\"\\\",D31)),ISERR(FIND(\"/\",D31)),ISERR(FIND(\"%\",D31)),ISERR(FIND(\"^\",D31)),ISERR(FIND(\"`\",D31)),ISERR(FIND(\"{\",D31)),ISERR(FIND(\"}\",D31)),ISERR(FIND(\"~\",D31)),ISERR(FIND(\"[\",D31)),ISERR(FIND(\"]\",D31)),ISERR(FIND(\"!\",D31)),ISERR(FIND(\"&\",D31)),ISERR(FIND(\"+\",D31)),ISERR(FIND(\"=\",D31)),ISERR(FIND(\"?\",D31)),ISERR(FIND(\"#\",D31)),ISERR(FIND(CHAR(34),D31))),\"\",\"CV\")","v":""},{"$f":"IF(T31=\"CV\",SUBSTITUTE(SUBSTITUTE(SUBSTITUTE(SUBSTITUTE(SUBSTITUTE(SUBSTITUTE(SUBSTITUTE(SUBSTITUTE(SUBSTITUTE(SUBSTITUTE(SUBSTITUTE(SUBSTITUTE(SUBSTITUTE(SUBSTITUTE(SUBSTITUTE(SUBSTITUTE(SUBSTITUTE(SUBSTITUTE(SUBSTITUTE(SUBSTITUTE(D31,\"*\",\"\"),\"<\",\"\"),\">\",\"\"),\"\\\",\"\"),\"/\",\"\"),\"%\",\"\"),\"^\",\"\"),\"`\",\"\"),\"{\",\"\"),\"}\",\"\"),\"~\",\"\"),\"[\",\"\"),\"]\",\"\"),\"!\",\"\"),\"&\",\"\"),\"+\",\"\"),\"=\",\"\"),\"?\",\"\"),\"#\",\"\"),CHAR(34),\"\"),\"\")","v":""},{"$f":"IF(LEN(D31)>150,\"NC\",\"\")","v":""},{"$f":"IF(E31<>\"\",LEN(SUM(MID(0&E31,LARGE(ISNUMBER(--MID(E31,ROW(INDIRECT(\"1:\"&LEN(E31))),1))* ROW(INDIRECT(\"1:\"&LEN(E31))),ROW(INDIRECT(\"1:\"&LEN(E31))))+1,1)*10^ROW(INDIRECT(\"1:\"&LEN(E31)))/10)),\"\")","v":""},"",{"$f":"IF(X31=\"CV\",LEFT(E31,2)&\"-\"&RIGHT(E31,7),\"\")","v":""},{"$f":"IF(F31=\"\",\"\",IF(F31=\"Nonprofit\",IF(EXACT(UPPER(LEFT(F31,1)),LEFT(F31,1)),\"C\",\"CV\"),IF(F31=\"For Profit\",IF(AND(EXACT(UPPER(LEFT(F31,1)),LEFT(F31,1)),EXACT(UPPER(MID(F31,5,1)),MID(F31,5,1))),\"C\",\"CV\"),\"NC\")))","v":""},{"$f":"IF(AND(ISERR(FIND(\"*\",G31)),ISERR(FIND(\"<\",G31)),ISERR(FIND(\">\",G31)),ISERR(FIND(\"\\\",G31)),ISERR(FIND(\"/\",G31)),ISERR(FIND(\"%\",G31)),ISERR(FIND(\"^\",G31)),ISERR(FIND(\"`\",G31)),ISERR(FIND(\"{\",G31)),ISERR(FIND(\"}\",G31)),ISERR(FIND(\"~\",G31)),ISERR(FIND(\"[\",G31)),ISERR(FIND(\"]\",G31)),ISERR(FIND(\"!\",G31)),ISERR(FIND(\"&\",G31)),ISERR(FIND(\"+\",G31)),ISERR(FIND(\"=\",G31)),ISERR(FIND(\"?\",G31)),ISERR(FIND(\"#\",G31)),ISERR(FIND(CHAR(34),G31))),\"\",\"CV\")","v":""},{"$f":"IF(AA31=\"CV\",SUBSTITUTE(SUBSTITUTE(SUBSTITUTE(SUBSTITUTE(SUBSTITUTE(SUBSTITUTE(SUBSTITUTE(SUBSTITUTE(SUBSTITUTE(SUBSTITUTE(SUBSTITUTE(SUBSTITUTE(SUBSTITUTE(SUBSTITUTE(SUBSTITUTE(SUBSTITUTE(SUBSTITUTE(SUBSTITUTE(SUBSTITUTE(SUBSTITUTE(G31,\"*\",\"\"),\"<\",\"\"),\">\",\"\"),\"\\\",\"\"),\"/\",\"\"),\"%\",\"\"),\"^\",\"\"),\"`\",\"\"),\"{\",\"\"),\"}\",\"\"),\"~\",\"\"),\"[\",\"\"),\"]\",\"\"),\"!\",\"\"),\"&\",\"\"),\"+\",\"\"),\"=\",\"\"),\"?\",\"\"),\"#\",\"\"),CHAR(34),\"\"),\"\")","v":""},{"$f":"IF(LEN(G31)>150,\"NC\",\"\")","v":""},{"$f":"IF(AND(ISERR(FIND(\"*\",H31)),ISERR(FIND(\"<\",H31)),ISERR(FIND(\">\",H31)),ISERR(FIND(\"\\\",H31)),ISERR(FIND(\"/\",H31)),ISERR(FIND(\"%\",H31)),ISERR(FIND(\"^\",H31)),ISERR(FIND(\"`\",H31)),ISERR(FIND(\"{\",H31)),ISERR(FIND(\"}\",H31)),ISERR(FIND(\"~\",H31)),ISERR(FIND(\"[\",H31)),ISERR(FIND(\"]\",H31)),ISERR(FIND(\"!\",H31)),ISERR(FIND(\"&\",H31)),ISERR(FIND(\"+\",H31)),ISERR(FIND(\"=\",H31)),ISERR(FIND(\"?\",H31)),ISERR(FIND(\"#\",H31)),ISERR(FIND(CHAR(34),H31))),\"\",\"CV\")","v":""},{"$f":"IF(AD31=\"CV\",SUBSTITUTE(SUBSTITUTE(SUBSTITUTE(SUBSTITUTE(SUBSTITUTE(SUBSTITUTE(SUBSTITUTE(SUBSTITUTE(SUBSTITUTE(SUBSTITUTE(SUBSTITUTE(SUBSTITUTE(SUBSTITUTE(SUBSTITUTE(SUBSTITUTE(SUBSTITUTE(SUBSTITUTE(SUBSTITUTE(SUBSTITUTE(SUBSTITUTE(H31,\"*\",\"\"),\"<\",\"\"),\">\",\"\"),\"\\\",\"\"),\"/\",\"\"),\"%\",\"\"),\"^\",\"\"),\"`\",\"\"),\"{\",\"\"),\"}\",\"\"),\"~\",\"\"),\"[\",\"\"),\"]\",\"\"),\"!\",\"\"),\"&\",\"\"),\"+\",\"\"),\"=\",\"\"),\"?\",\"\"),\"#\",\"\"),CHAR(34),\"\"),\"\")","v":""},{"$f":"IF(LEN(H31)>150,\"NC\",\"\")","v":""},{"$f":"IF(AND(ISERR(FIND(\"*\",I31)),ISERR(FIND(\"<\",I31)),ISERR(FIND(\">\",I31)),ISERR(FIND(\"\\\",I31)),ISERR(FIND(\"/\",I31)),ISERR(FIND(\"%\",I31)),ISERR(FIND(\"^\",I31)),ISERR(FIND(\"`\",I31)),ISERR(FIND(\"{\",I31)),ISERR(FIND(\"}\",I31)),ISERR(FIND(\"~\",I31)),ISERR(FIND(\"[\",I31)),ISERR(FIND(\"]\",I31)),ISERR(FIND(\"!\",I31)),ISERR(FIND(\"&\",I31)),ISERR(FIND(\"+\",I31)),ISERR(FIND(\"=\",I31)),ISERR(FIND(\"?\",I31)),ISERR(FIND(\"#\",I31)),ISERR(FIND(CHAR(34),I31))),\"\",\"CV\")","v":""},{"$f":"IF(AG31=\"CV\",SUBSTITUTE(SUBSTITUTE(SUBSTITUTE(SUBSTITUTE(SUBSTITUTE(SUBSTITUTE(SUBSTITUTE(SUBSTITUTE(SUBSTITUTE(SUBSTITUTE(SUBSTITUTE(SUBSTITUTE(SUBSTITUTE(SUBSTITUTE(SUBSTITUTE(SUBSTITUTE(SUBSTITUTE(SUBSTITUTE(SUBSTITUTE(SUBSTITUTE(I31,\"*\",\"\"),\"<\",\"\"),\">\",\"\"),\"\\\",\"\"),\"/\",\"\"),\"%\",\"\"),\"^\",\"\"),\"`\",\"\"),\"{\",\"\"),\"}\",\"\"),\"~\",\"\"),\"[\",\"\"),\"]\",\"\"),\"!\",\"\"),\"&\",\"\"),\"+\",\"\"),\"=\",\"\"),\"?\",\"\"),\"#\",\"\"),CHAR(34),\"\"),\"\")","v":""},{"$f":"IF(LEN(I31)>150,\"NC\",\"\")","v":""},{"$f":"IF(J31=\"\",\"\",IF(ISNA(MATCH(J31,Arrays!$G$3:$G$58,0)),IF(ISNA(MATCH(J31,Arrays!$H$3:$H$58,0)),\"NC\",\"CV\"),IF(EXACT(UPPER(J31),J31),\"C\",\"CV\")))","v":""},{"$f":"IF(AJ31=\"CV\",IF(ISNA(MATCH(J31,Arrays!$G$3:$G$58,0)),INDEX(Arrays!$G$3:$H$58,MATCH(J31,Arrays!$H$3:$H$58,0),1),UPPER(J31)),\"\")","v":""},{"$f":"IF(K31=\"\",\"\",LEN(SUM(MID(0&K31,LARGE(ISNUMBER(--MID(K31,ROW(INDIRECT(\"1:\"&LEN(K31))),1))* ROW(INDIRECT(\"1:\"&LEN(K31))),ROW(INDIRECT(\"1:\"&LEN(K31))))+1,1)*10^ROW(INDIRECT(\"1:\"&LEN(K31)))/10)))","v":""},{"$f":"IF(K31=\"\",\"\",IF(OR(AND(AL31=5,LEN(K31)=5),AND(AL31=9,LEN(K31)=10,MID(K31,6,1)=\"-\"),AND(AL31=4,LEN(K31)=5,LEFT(K31,1)=\"0\"),AND(AL31=8,LEN(K31)=10,MID(K31,6,1)=\"-\",LEFT(K31,1)=\"0\")),\"C\",IF(OR(AND(AL31=9,LEN(K31)=9),AND(AL31=8,LEN(K31)=9,LEFT(K31,1)=\"0\")),\"CV\",\"NC\")))","v":""},{"$f":"IF(K31=\"\",\"\",IF(ISTEXT(K31),\"\",TEXT(K31,\"##\")))","v":""},{"$f":"IF(AN31<>\"CV\",IF(AM31=\"CV\",LEFT(K31,5)&\"-\"&RIGHT(K31,4),\"\"),IF(LEN(K31)=5,TEXT(K31,\"#\"),IF(AN31=\"CV\",LEFT(K31,5)&\"-\"&RIGHT(K31,4),IF(AND(LEN(K31)=3,(COUNTIFS(Arrays!$I$3:$I$7,'Data Entry Worksheet'!#REF!,Arrays!$K$3:$K$7,LEFT(K31,1))+COUNTIFS(Arrays!$J$3:$J$7,'Data Entry Worksheet'!#REF!,Arrays!$K$3:$K$7,LEFT(K31,1)))>0),\"00\"&TEXT(K31,\"#\"),IF(AND(LEN(K31)=4,(COUNTIFS(Arrays!$M$3:$M$13,'Data Entry Worksheet'!#REF!,Arrays!$O$3:$O$13,LEFT(K31,1))+COUNTIFS(Arrays!$N$3:$N$13,'Data Entry Worksheet'!#REF!,Arrays!$O$3:$O$13,LEFT(K31,1)))>0),\"0\"&TEXT(K31,\"#\"),\"\")))))","v":""},{"$f":"IF(L31=\"\",\"\",IF(ISNA(MATCH(L31,Arrays!$G$3:$G$58,0)),IF(ISNA(MATCH(L31,Arrays!$H$3:$H$58,0)),\"NC\",\"CV\"),IF(EXACT(UPPER(L31),L31),\"C\",\"CV\")))","v":""},{"$f":"IF(AP31=\"CV\",IF(ISNA(MATCH(L31,Arrays!$G$3:$G$58,0)),INDEX(Arrays!$G$3:$H$58,MATCH(L31,Arrays!$H$3:$H$58,0),1),UPPER(L31)),\"\")","v":""},{"$f":"IF(M31=\"\",\"\",IF(ISERR(1*M31),\"NC\",IF(AND(1*M31<=YEAR(TODAY()),1*M31>2013),\"C\",\"NC\")))","v":""},{"$f":"IF(OR(F31=\"C\",F31=\"\"),\"\",IF(F31=\"nonprofit\",\"Nonprofit\",\"For Profit\"))","v":""},{"$f":"IF(AS31=\"CV\",TEXT(M31,\"##\"),\"\")","v":""},{"$f":"IF(N31=\"\",\"\",IF(ISERR(1*N31),\"NC\",IF(ISTEXT(N31),\"TX\",\"C\")))","v":""},{"$f":"IF(AU31=\"TX\",1*N31,\"\")","v":""},{"$f":"IF(O31=\"\",\"\",IF(ISNA(MATCH(O31,Arrays!$G$60:$G$65,0)),\"NC\",IF(EXACT(UPPER(O31),O31),\"C\",\"CV\")))","v":""},{"$f":"IF(AW31=\"\",\"\",UPPER(O31))","v":""}]
[{"$f":"IF(COUNTIF(D32:O32,\"\")<>12,ROW()-17,IF(COUNT(INDIRECT(ADDRESS(ROW()+1,COLUMN(),4)&\":A50000\"))>0,ROW()-17,\"\"))","v":""},{"$f":"IF(A32<>\"\",D$3,\"\")","v":""},{"$f":"IF(B32<>\"\",D$5,\"\")","v":""},null,null,null,null,null,null,null,null,null,null,null,null,"","",{"$f":"IF(COUNTIF(T32:AX32,\"NC\")>0,\"Error\"&IF(COUNTIF(T32:AX32,\"CV\")>0,\"/Format\",\"\"),IF(COUNTIF(T32:AX32,\"CV\")>0,\"Format\",\"\"))","v":""},null,{"$f":"IF(AND(ISERR(FIND(\"*\",D32)),ISERR(FIND(\"<\",D32)),ISERR(FIND(\">\",D32)),ISERR(FIND(\"\\\",D32)),ISERR(FIND(\"/\",D32)),ISERR(FIND(\"%\",D32)),ISERR(FIND(\"^\",D32)),ISERR(FIND(\"`\",D32)),ISERR(FIND(\"{\",D32)),ISERR(FIND(\"}\",D32)),ISERR(FIND(\"~\",D32)),ISERR(FIND(\"[\",D32)),ISERR(FIND(\"]\",D32)),ISERR(FIND(\"!\",D32)),ISERR(FIND(\"&\",D32)),ISERR(FIND(\"+\",D32)),ISERR(FIND(\"=\",D32)),ISERR(FIND(\"?\",D32)),ISERR(FIND(\"#\",D32)),ISERR(FIND(CHAR(34),D32))),\"\",\"CV\")","v":""},{"$f":"IF(T32=\"CV\",SUBSTITUTE(SUBSTITUTE(SUBSTITUTE(SUBSTITUTE(SUBSTITUTE(SUBSTITUTE(SUBSTITUTE(SUBSTITUTE(SUBSTITUTE(SUBSTITUTE(SUBSTITUTE(SUBSTITUTE(SUBSTITUTE(SUBSTITUTE(SUBSTITUTE(SUBSTITUTE(SUBSTITUTE(SUBSTITUTE(SUBSTITUTE(SUBSTITUTE(D32,\"*\",\"\"),\"<\",\"\"),\">\",\"\"),\"\\\",\"\"),\"/\",\"\"),\"%\",\"\"),\"^\",\"\"),\"`\",\"\"),\"{\",\"\"),\"}\",\"\"),\"~\",\"\"),\"[\",\"\"),\"]\",\"\"),\"!\",\"\"),\"&\",\"\"),\"+\",\"\"),\"=\",\"\"),\"?\",\"\"),\"#\",\"\"),CHAR(34),\"\"),\"\")","v":""},{"$f":"IF(LEN(D32)>150,\"NC\",\"\")","v":""},{"$f":"IF(E32<>\"\",LEN(SUM(MID(0&E32,LARGE(ISNUMBER(--MID(E32,ROW(INDIRECT(\"1:\"&LEN(E32))),1))* ROW(INDIRECT(\"1:\"&LEN(E32))),ROW(INDIRECT(\"1:\"&LEN(E32))))+1,1)*10^ROW(INDIRECT(\"1:\"&LEN(E32)))/10)),\"\")","v":""},"",{"$f":"IF(X32=\"CV\",LEFT(E32,2)&\"-\"&RIGHT(E32,7),\"\")","v":""},{"$f":"IF(F32=\"\",\"\",IF(F32=\"Nonprofit\",IF(EXACT(UPPER(LEFT(F32,1)),LEFT(F32,1)),\"C\",\"CV\"),IF(F32=\"For Profit\",IF(AND(EXACT(UPPER(LEFT(F32,1)),LEFT(F32,1)),EXACT(UPPER(MID(F32,5,1)),MID(F32,5,1))),\"C\",\"CV\"),\"NC\")))","v":""},{"$f":"IF(AND(ISERR(FIND(\"*\",G32)),ISERR(FIND(\"<\",G32)),ISERR(FIND(\">\",G32)),ISERR(FIND(\"\\\",G32)),ISERR(FIND(\"/\",G32)),ISERR(FIND(\"%\",G32)),ISERR(FIND(\"^\",G32)),ISERR(FIND(\"`\",G32)),ISERR(FIND(\"{\",G32)),ISERR(FIND(\"}\",G32)),ISERR(FIND(\"~\",G32)),ISERR(FIND(\"[\",G32)),ISERR(FIND(\"]\",G32)),ISERR(FIND(\"!\",G32)),ISERR(FIND(\"&\",G32)),ISERR(FIND(\"+\",G32)),ISERR(FIND(\"=\",G32)),ISERR(FIND(\"?\",G32)),ISERR(FIND(\"#\",G32)),ISERR(FIND(CHAR(34),G32))),\"\",\"CV\")","v":""},{"$f":"IF(AA32=\"CV\",SUBSTITUTE(SUBSTITUTE(SUBSTITUTE(SUBSTITUTE(SUBSTITUTE(SUBSTITUTE(SUBSTITUTE(SUBSTITUTE(SUBSTITUTE(SUBSTITUTE(SUBSTITUTE(SUBSTITUTE(SUBSTITUTE(SUBSTITUTE(SUBSTITUTE(SUBSTITUTE(SUBSTITUTE(SUBSTITUTE(SUBSTITUTE(SUBSTITUTE(G32,\"*\",\"\"),\"<\",\"\"),\">\",\"\"),\"\\\",\"\"),\"/\",\"\"),\"%\",\"\"),\"^\",\"\"),\"`\",\"\"),\"{\",\"\"),\"}\",\"\"),\"~\",\"\"),\"[\",\"\"),\"]\",\"\"),\"!\",\"\"),\"&\",\"\"),\"+\",\"\"),\"=\",\"\"),\"?\",\"\"),\"#\",\"\"),CHAR(34),\"\"),\"\")","v":""},{"$f":"IF(LEN(G32)>150,\"NC\",\"\")","v":""},{"$f":"IF(AND(ISERR(FIND(\"*\",H32)),ISERR(FIND(\"<\",H32)),ISERR(FIND(\">\",H32)),ISERR(FIND(\"\\\",H32)),ISERR(FIND(\"/\",H32)),ISERR(FIND(\"%\",H32)),ISERR(FIND(\"^\",H32)),ISERR(FIND(\"`\",H32)),ISERR(FIND(\"{\",H32)),ISERR(FIND(\"}\",H32)),ISERR(FIND(\"~\",H32)),ISERR(FIND(\"[\",H32)),ISERR(FIND(\"]\",H32)),ISERR(FIND(\"!\",H32)),ISERR(FIND(\"&\",H32)),ISERR(FIND(\"+\",H32)),ISERR(FIND(\"=\",H32)),ISERR(FIND(\"?\",H32)),ISERR(FIND(\"#\",H32)),ISERR(FIND(CHAR(34),H32))),\"\",\"CV\")","v":""},{"$f":"IF(AD32=\"CV\",SUBSTITUTE(SUBSTITUTE(SUBSTITUTE(SUBSTITUTE(SUBSTITUTE(SUBSTITUTE(SUBSTITUTE(SUBSTITUTE(SUBSTITUTE(SUBSTITUTE(SUBSTITUTE(SUBSTITUTE(SUBSTITUTE(SUBSTITUTE(SUBSTITUTE(SUBSTITUTE(SUBSTITUTE(SUBSTITUTE(SUBSTITUTE(SUBSTITUTE(H32,\"*\",\"\"),\"<\",\"\"),\">\",\"\"),\"\\\",\"\"),\"/\",\"\"),\"%\",\"\"),\"^\",\"\"),\"`\",\"\"),\"{\",\"\"),\"}\",\"\"),\"~\",\"\"),\"[\",\"\"),\"]\",\"\"),\"!\",\"\"),\"&\",\"\"),\"+\",\"\"),\"=\",\"\"),\"?\",\"\"),\"#\",\"\"),CHAR(34),\"\"),\"\")","v":""},{"$f":"IF(LEN(H32)>150,\"NC\",\"\")","v":""},{"$f":"IF(AND(ISERR(FIND(\"*\",I32)),ISERR(FIND(\"<\",I32)),ISERR(FIND(\">\",I32)),ISERR(FIND(\"\\\",I32)),ISERR(FIND(\"/\",I32)),ISERR(FIND(\"%\",I32)),ISERR(FIND(\"^\",I32)),ISERR(FIND(\"`\",I32)),ISERR(FIND(\"{\",I32)),ISERR(FIND(\"}\",I32)),ISERR(FIND(\"~\",I32)),ISERR(FIND(\"[\",I32)),ISERR(FIND(\"]\",I32)),ISERR(FIND(\"!\",I32)),ISERR(FIND(\"&\",I32)),ISERR(FIND(\"+\",I32)),ISERR(FIND(\"=\",I32)),ISERR(FIND(\"?\",I32)),ISERR(FIND(\"#\",I32)),ISERR(FIND(CHAR(34),I32))),\"\",\"CV\")","v":""},{"$f":"IF(AG32=\"CV\",SUBSTITUTE(SUBSTITUTE(SUBSTITUTE(SUBSTITUTE(SUBSTITUTE(SUBSTITUTE(SUBSTITUTE(SUBSTITUTE(SUBSTITUTE(SUBSTITUTE(SUBSTITUTE(SUBSTITUTE(SUBSTITUTE(SUBSTITUTE(SUBSTITUTE(SUBSTITUTE(SUBSTITUTE(SUBSTITUTE(SUBSTITUTE(SUBSTITUTE(I32,\"*\",\"\"),\"<\",\"\"),\">\",\"\"),\"\\\",\"\"),\"/\",\"\"),\"%\",\"\"),\"^\",\"\"),\"`\",\"\"),\"{\",\"\"),\"}\",\"\"),\"~\",\"\"),\"[\",\"\"),\"]\",\"\"),\"!\",\"\"),\"&\",\"\"),\"+\",\"\"),\"=\",\"\"),\"?\",\"\"),\"#\",\"\"),CHAR(34),\"\"),\"\")","v":""},{"$f":"IF(LEN(I32)>150,\"NC\",\"\")","v":""},{"$f":"IF(J32=\"\",\"\",IF(ISNA(MATCH(J32,Arrays!$G$3:$G$58,0)),IF(ISNA(MATCH(J32,Arrays!$H$3:$H$58,0)),\"NC\",\"CV\"),IF(EXACT(UPPER(J32),J32),\"C\",\"CV\")))","v":""},{"$f":"IF(AJ32=\"CV\",IF(ISNA(MATCH(J32,Arrays!$G$3:$G$58,0)),INDEX(Arrays!$G$3:$H$58,MATCH(J32,Arrays!$H$3:$H$58,0),1),UPPER(J32)),\"\")","v":""},{"$f":"IF(K32=\"\",\"\",LEN(SUM(MID(0&K32,LARGE(ISNUMBER(--MID(K32,ROW(INDIRECT(\"1:\"&LEN(K32))),1))* ROW(INDIRECT(\"1:\"&LEN(K32))),ROW(INDIRECT(\"1:\"&LEN(K32))))+1,1)*10^ROW(INDIRECT(\"1:\"&LEN(K32)))/10)))","v":""},{"$f":"IF(K32=\"\",\"\",IF(OR(AND(AL32=5,LEN(K32)=5),AND(AL32=9,LEN(K32)=10,MID(K32,6,1)=\"-\"),AND(AL32=4,LEN(K32)=5,LEFT(K32,1)=\"0\"),AND(AL32=8,LEN(K32)=10,MID(K32,6,1)=\"-\",LEFT(K32,1)=\"0\")),\"C\",IF(OR(AND(AL32=9,LEN(K32)=9),AND(AL32=8,LEN(K32)=9,LEFT(K32,1)=\"0\")),\"CV\",\"NC\")))","v":""},{"$f":"IF(K32=\"\",\"\",IF(ISTEXT(K32),\"\",TEXT(K32,\"##\")))","v":""},{"$f":"IF(AN32<>\"CV\",IF(AM32=\"CV\",LEFT(K32,5)&\"-\"&RIGHT(K32,4),\"\"),IF(LEN(K32)=5,TEXT(K32,\"#\"),IF(AN32=\"CV\",LEFT(K32,5)&\"-\"&RIGHT(K32,4),IF(AND(LEN(K32)=3,(COUNTIFS(Arrays!$I$3:$I$7,'Data Entry Worksheet'!#REF!,Arrays!$K$3:$K$7,LEFT(K32,1))+COUNTIFS(Arrays!$J$3:$J$7,'Data Entry Worksheet'!#REF!,Arrays!$K$3:$K$7,LEFT(K32,1)))>0),\"00\"&TEXT(K32,\"#\"),IF(AND(LEN(K32)=4,(COUNTIFS(Arrays!$M$3:$M$13,'Data Entry Worksheet'!#REF!,Arrays!$O$3:$O$13,LEFT(K32,1))+COUNTIFS(Arrays!$N$3:$N$13,'Data Entry Worksheet'!#REF!,Arrays!$O$3:$O$13,LEFT(K32,1)))>0),\"0\"&TEXT(K32,\"#\"),\"\")))))","v":""},{"$f":"IF(L32=\"\",\"\",IF(ISNA(MATCH(L32,Arrays!$G$3:$G$58,0)),IF(ISNA(MATCH(L32,Arrays!$H$3:$H$58,0)),\"NC\",\"CV\"),IF(EXACT(UPPER(L32),L32),\"C\",\"CV\")))","v":""},{"$f":"IF(AP32=\"CV\",IF(ISNA(MATCH(L32,Arrays!$G$3:$G$58,0)),INDEX(Arrays!$G$3:$H$58,MATCH(L32,Arrays!$H$3:$H$58,0),1),UPPER(L32)),\"\")","v":""},{"$f":"IF(M32=\"\",\"\",IF(ISERR(1*M32),\"NC\",IF(AND(1*M32<=YEAR(TODAY()),1*M32>2013),\"C\",\"NC\")))","v":""},{"$f":"IF(OR(F32=\"C\",F32=\"\"),\"\",IF(F32=\"nonprofit\",\"Nonprofit\",\"For Profit\"))","v":""},{"$f":"IF(AS32=\"CV\",TEXT(M32,\"##\"),\"\")","v":""},{"$f":"IF(N32=\"\",\"\",IF(ISERR(1*N32),\"NC\",IF(ISTEXT(N32),\"TX\",\"C\")))","v":""},{"$f":"IF(AU32=\"TX\",1*N32,\"\")","v":""},{"$f":"IF(O32=\"\",\"\",IF(ISNA(MATCH(O32,Arrays!$G$60:$G$65,0)),\"NC\",IF(EXACT(UPPER(O32),O32),\"C\",\"CV\")))","v":""},{"$f":"IF(AW32=\"\",\"\",UPPER(O32))","v":""}]
["","","",null,null,null,null,null,null,null,null,null,null,null,null,"","","",null,"","","",{"$f":"IF(E33<>\"\",LEN(SUM(MID(0&E33,LARGE(ISNUMBER(--MID(E33,ROW(INDIRECT(\"1:\"&LEN(E33))),1))* ROW(INDIRECT(\"1:\"&LEN(E33))),ROW(INDIRECT(\"1:\"&LEN(E33))))+1,1)*10^ROW(INDIRECT(\"1:\"&LEN(E33)))/10)),\"\")","v":""},"","","","","","","","","","","","",{"$f":"IF(J33=\"\",\"\",IF(ISNA(MATCH(J33,Arrays!$G$3:$G$58,0)),IF(ISNA(MATCH(J33,Arrays!$H$3:$H$58,0)),\"NC\",\"CV\"),IF(EXACT(UPPER(J33),J33),\"C\",\"CV\")))","v":""},{"$f":"IF(AJ33=\"CV\",IF(ISNA(MATCH(J33,Arrays!$G$3:$G$58,0)),INDEX(Arrays!$G$3:$H$58,MATCH(J33,Arrays!$H$3:$H$58,0),1),UPPER(J33)),\"\")","v":""},{"$f":"IF(K33=\"\",\"\",LEN(SUM(MID(0&K33,LARGE(ISNUMBER(--MID(K33,ROW(INDIRECT(\"1:\"&LEN(K33))),1))* ROW(INDIRECT(\"1:\"&LEN(K33))),ROW(INDIRECT(\"1:\"&LEN(K33))))+1,1)*10^ROW(INDIRECT(\"1:\"&LEN(K33)))/10)))","v":""},"","",{"$f":"IF(AN33<>\"CV\",IF(AM33=\"CV\",LEFT(K33,5)&\"-\"&RIGHT(K33,4),\"\"),IF(LEN(K33)=5,TEXT(K33,\"#\"),IF(AN33=\"CV\",LEFT(K33,5)&\"-\"&RIGHT(K33,4),IF(AND(LEN(K33)=3,(COUNTIFS(Arrays!$I$3:$I$7,'Data Entry Worksheet'!#REF!,Arrays!$K$3:$K$7,LEFT(K33,1))+COUNTIFS(Arrays!$J$3:$J$7,'Data Entry Worksheet'!#REF!,Arrays!$K$3:$K$7,LEFT(K33,1)))>0),\"00\"&TEXT(K33,\"#\"),IF(AND(LEN(K33)=4,(COUNTIFS(Arrays!$M$3:$M$13,'Data Entry Worksheet'!#REF!,Arrays!$O$3:$O$13,LEFT(K33,1))+COUNTIFS(Arrays!$N$3:$N$13,'Data Entry Worksheet'!#REF!,Arrays!$O$3:$O$13,LEFT(K33,1)))>0),\"0\"&TEXT(K33,\"#\"),\"\")))))","v":""},{"$f":"IF(L33=\"\",\"\",IF(ISNA(MATCH(L33,Arrays!$G$3:$G$58,0)),IF(ISNA(MATCH(L33,Arrays!$H$3:$H$58,0)),\"NC\",\"CV\"),IF(EXACT(UPPER(L33),L33),\"C\",\"CV\")))","v":""},{"$f":"IF(AP33=\"CV\",IF(ISNA(MATCH(L33,Arrays!$G$3:$G$58,0)),INDEX(Arrays!$G$3:$H$58,MATCH(L33,Arrays!$H$3:$H$58,0),1),UPPER(L33)),\"\")","v":""},"","","","","",{"$f":"IF(O33=\"\",\"\",IF(ISNA(MATCH(O33,Arrays!$G$60:$G$65,0)),\"NC\",IF(EXACT(UPPER(O33),O33),\"C\",\"CV\")))","v":""},""]
["","","",null,null,null,null,null,null,null,null,null,null,null,null,"","","",null,"","","",{"$f":"IF(E34<>\"\",LEN(SUM(MID(0&E34,LARGE(ISNUMBER(--MID(E34,ROW(INDIRECT(\"1:\"&LEN(E34))),1))* ROW(INDIRECT(\"1:\"&LEN(E34))),ROW(INDIRECT(\"1:\"&LEN(E34))))+1,1)*10^ROW(INDIRECT(\"1:\"&LEN(E34)))/10)),\"\")","v":""},"","","","","","","","","","","","",{"$f":"IF(J34=\"\",\"\",IF(ISNA(MATCH(J34,Arrays!$G$3:$G$58,0)),IF(ISNA(MATCH(J34,Arrays!$H$3:$H$58,0)),\"NC\",\"CV\"),IF(EXACT(UPPER(J34),J34),\"C\",\"CV\")))","v":""},{"$f":"IF(AJ34=\"CV\",IF(ISNA(MATCH(J34,Arrays!$G$3:$G$58,0)),INDEX(Arrays!$G$3:$H$58,MATCH(J34,Arrays!$H$3:$H$58,0),1),UPPER(J34)),\"\")","v":""},{"$f":"IF(K34=\"\",\"\",LEN(SUM(MID(0&K34,LARGE(ISNUMBER(--MID(K34,ROW(INDIRECT(\"1:\"&LEN(K34))),1))* ROW(INDIRECT(\"1:\"&LEN(K34))),ROW(INDIRECT(\"1:\"&LEN(K34))))+1,1)*10^ROW(INDIRECT(\"1:\"&LEN(K34)))/10)))","v":""},"","",{"$f":"IF(AN34<>\"CV\",IF(AM34=\"CV\",LEFT(K34,5)&\"-\"&RIGHT(K34,4),\"\"),IF(LEN(K34)=5,TEXT(K34,\"#\"),IF(AN34=\"CV\",LEFT(K34,5)&\"-\"&RIGHT(K34,4),IF(AND(LEN(K34)=3,(COUNTIFS(Arrays!$I$3:$I$7,'Data Entry Worksheet'!#REF!,Arrays!$K$3:$K$7,LEFT(K34,1))+COUNTIFS(Arrays!$J$3:$J$7,'Data Entry Worksheet'!#REF!,Arrays!$K$3:$K$7,LEFT(K34,1)))>0),\"00\"&TEXT(K34,\"#\"),IF(AND(LEN(K34)=4,(COUNTIFS(Arrays!$M$3:$M$13,'Data Entry Worksheet'!#REF!,Arrays!$O$3:$O$13,LEFT(K34,1))+COUNTIFS(Arrays!$N$3:$N$13,'Data Entry Worksheet'!#REF!,Arrays!$O$3:$O$13,LEFT(K34,1)))>0),\"0\"&TEXT(K34,\"#\"),\"\")))))","v":""},{"$f":"IF(L34=\"\",\"\",IF(ISNA(MATCH(L34,Arrays!$G$3:$G$58,0)),IF(ISNA(MATCH(L34,Arrays!$H$3:$H$58,0)),\"NC\",\"CV\"),IF(EXACT(UPPER(L34),L34),\"C\",\"CV\")))","v":""},{"$f":"IF(AP34=\"CV\",IF(ISNA(MATCH(L34,Arrays!$G$3:$G$58,0)),INDEX(Arrays!$G$3:$H$58,MATCH(L34,Arrays!$H$3:$H$58,0),1),UPPER(L34)),\"\")","v":""},"","","","","",{"$f":"IF(O34=\"\",\"\",IF(ISNA(MATCH(O34,Arrays!$G$60:$G$65,0)),\"NC\",IF(EXACT(UPPER(O34),O34),\"C\",\"CV\")))","v":""},""]
["","","",null,null,null,null,null,null,null,null,null,null,null,null,"","","",null,"","","",{"$f":"IF(E35<>\"\",LEN(SUM(MID(0&E35,LARGE(ISNUMBER(--MID(E35,ROW(INDIRECT(\"1:\"&LEN(E35))),1))* ROW(INDIRECT(\"1:\"&LEN(E35))),ROW(INDIRECT(\"1:\"&LEN(E35))))+1,1)*10^ROW(INDIRECT(\"1:\"&LEN(E35)))/10)),\"\")","v":""},"","","","","","","","","","","","",{"$f":"IF(J35=\"\",\"\",IF(ISNA(MATCH(J35,Arrays!$G$3:$G$58,0)),IF(ISNA(MATCH(J35,Arrays!$H$3:$H$58,0)),\"NC\",\"CV\"),IF(EXACT(UPPER(J35),J35),\"C\",\"CV\")))","v":""},{"$f":"IF(AJ35=\"CV\",IF(ISNA(MATCH(J35,Arrays!$G$3:$G$58,0)),INDEX(Arrays!$G$3:$H$58,MATCH(J35,Arrays!$H$3:$H$58,0),1),UPPER(J35)),\"\")","v":""},{"$f":"IF(K35=\"\",\"\",LEN(SUM(MID(0&K35,LARGE(ISNUMBER(--MID(K35,ROW(INDIRECT(\"1:\"&LEN(K35))),1))* ROW(INDIRECT(\"1:\"&LEN(K35))),ROW(INDIRECT(\"1:\"&LEN(K35))))+1,1)*10^ROW(INDIRECT(\"1:\"&LEN(K35)))/10)))","v":""},"","",{"$f":"IF(AN35<>\"CV\",IF(AM35=\"CV\",LEFT(K35,5)&\"-\"&RIGHT(K35,4),\"\"),IF(LEN(K35)=5,TEXT(K35,\"#\"),IF(AN35=\"CV\",LEFT(K35,5)&\"-\"&RIGHT(K35,4),IF(AND(LEN(K35)=3,(COUNTIFS(Arrays!$I$3:$I$7,'Data Entry Worksheet'!#REF!,Arrays!$K$3:$K$7,LEFT(K35,1))+COUNTIFS(Arrays!$J$3:$J$7,'Data Entry Worksheet'!#REF!,Arrays!$K$3:$K$7,LEFT(K35,1)))>0),\"00\"&TEXT(K35,\"#\"),IF(AND(LEN(K35)=4,(COUNTIFS(Arrays!$M$3:$M$13,'Data Entry Worksheet'!#REF!,Arrays!$O$3:$O$13,LEFT(K35,1))+COUNTIFS(Arrays!$N$3:$N$13,'Data Entry Worksheet'!#REF!,Arrays!$O$3:$O$13,LEFT(K35,1)))>0),\"0\"&TEXT(K35,\"#\"),\"\")))))","v":""},{"$f":"IF(L35=\"\",\"\",IF(ISNA(MATCH(L35,Arrays!$G$3:$G$58,0)),IF(ISNA(MATCH(L35,Arrays!$H$3:$H$58,0)),\"NC\",\"CV\"),IF(EXACT(UPPER(L35),L35),\"C\",\"CV\")))","v":""},{"$f":"IF(AP35=\"CV\",IF(ISNA(MATCH(L35,Arrays!$G$3:$G$58,0)),INDEX(Arrays!$G$3:$H$58,MATCH(L35,Arrays!$H$3:$H$58,0),1),UPPER(L35)),\"\")","v":""},"","","","","",{"$f":"IF(O35=\"\",\"\",IF(ISNA(MATCH(O35,Arrays!$G$60:$G$65,0)),\"NC\",IF(EXACT(UPPER(O35),O35),\"C\",\"CV\")))","v":""},""]
["","","",null,null,null,null,null,null,null,null,null,null,null,null,"","","",null,"","","",{"$f":"IF(E36<>\"\",LEN(SUM(MID(0&E36,LARGE(ISNUMBER(--MID(E36,ROW(INDIRECT(\"1:\"&LEN(E36))),1))* ROW(INDIRECT(\"1:\"&LEN(E36))),ROW(INDIRECT(\"1:\"&LEN(E36))))+1,1)*10^ROW(INDIRECT(\"1:\"&LEN(E36)))/10)),\"\")","v":""},"","","","","","","","","","","","",{"$f":"IF(J36=\"\",\"\",IF(ISNA(MATCH(J36,Arrays!$G$3:$G$58,0)),IF(ISNA(MATCH(J36,Arrays!$H$3:$H$58,0)),\"NC\",\"CV\"),IF(EXACT(UPPER(J36),J36),\"C\",\"CV\")))","v":""},{"$f":"IF(AJ36=\"CV\",IF(ISNA(MATCH(J36,Arrays!$G$3:$G$58,0)),INDEX(Arrays!$G$3:$H$58,MATCH(J36,Arrays!$H$3:$H$58,0),1),UPPER(J36)),\"\")","v":""},{"$f":"IF(K36=\"\",\"\",LEN(SUM(MID(0&K36,LARGE(ISNUMBER(--MID(K36,ROW(INDIRECT(\"1:\"&LEN(K36))),1))* ROW(INDIRECT(\"1:\"&LEN(K36))),ROW(INDIRECT(\"1:\"&LEN(K36))))+1,1)*10^ROW(INDIRECT(\"1:\"&LEN(K36)))/10)))","v":""},"","",{"$f":"IF(AN36<>\"CV\",IF(AM36=\"CV\",LEFT(K36,5)&\"-\"&RIGHT(K36,4),\"\"),IF(LEN(K36)=5,TEXT(K36,\"#\"),IF(AN36=\"CV\",LEFT(K36,5)&\"-\"&RIGHT(K36,4),IF(AND(LEN(K36)=3,(COUNTIFS(Arrays!$I$3:$I$7,'Data Entry Worksheet'!#REF!,Arrays!$K$3:$K$7,LEFT(K36,1))+COUNTIFS(Arrays!$J$3:$J$7,'Data Entry Worksheet'!#REF!,Arrays!$K$3:$K$7,LEFT(K36,1)))>0),\"00\"&TEXT(K36,\"#\"),IF(AND(LEN(K36)=4,(COUNTIFS(Arrays!$M$3:$M$13,'Data Entry Worksheet'!#REF!,Arrays!$O$3:$O$13,LEFT(K36,1))+COUNTIFS(Arrays!$N$3:$N$13,'Data Entry Worksheet'!#REF!,Arrays!$O$3:$O$13,LEFT(K36,1)))>0),\"0\"&TEXT(K36,\"#\"),\"\")))))","v":""},{"$f":"IF(L36=\"\",\"\",IF(ISNA(MATCH(L36,Arrays!$G$3:$G$58,0)),IF(ISNA(MATCH(L36,Arrays!$H$3:$H$58,0)),\"NC\",\"CV\"),IF(EXACT(UPPER(L36),L36),\"C\",\"CV\")))","v":""},{"$f":"IF(AP36=\"CV\",IF(ISNA(MATCH(L36,Arrays!$G$3:$G$58,0)),INDEX(Arrays!$G$3:$H$58,MATCH(L36,Arrays!$H$3:$H$58,0),1),UPPER(L36)),\"\")","v":""},"","","","","",{"$f":"IF(O36=\"\",\"\",IF(ISNA(MATCH(O36,Arrays!$G$60:$G$65,0)),\"NC\",IF(EXACT(UPPER(O36),O36),\"C\",\"CV\")))","v":""},""]
["","","",null,null,null,null,null,null,null,null,null,null,null,null,"","","",null,"","","",{"$f":"IF(E37<>\"\",LEN(SUM(MID(0&E37,LARGE(ISNUMBER(--MID(E37,ROW(INDIRECT(\"1:\"&LEN(E37))),1))* ROW(INDIRECT(\"1:\"&LEN(E37))),ROW(INDIRECT(\"1:\"&LEN(E37))))+1,1)*10^ROW(INDIRECT(\"1:\"&LEN(E37)))/10)),\"\")","v":""},"","","","","","","","","","","","",{"$f":"IF(J37=\"\",\"\",IF(ISNA(MATCH(J37,Arrays!$G$3:$G$58,0)),IF(ISNA(MATCH(J37,Arrays!$H$3:$H$58,0)),\"NC\",\"CV\"),IF(EXACT(UPPER(J37),J37),\"C\",\"CV\")))","v":""},{"$f":"IF(AJ37=\"CV\",IF(ISNA(MATCH(J37,Arrays!$G$3:$G$58,0)),INDEX(Arrays!$G$3:$H$58,MATCH(J37,Arrays!$H$3:$H$58,0),1),UPPER(J37)),\"\")","v":""},{"$f":"IF(K37=\"\",\"\",LEN(SUM(MID(0&K37,LARGE(ISNUMBER(--MID(K37,ROW(INDIRECT(\"1:\"&LEN(K37))),1))* ROW(INDIRECT(\"1:\"&LEN(K37))),ROW(INDIRECT(\"1:\"&LEN(K37))))+1,1)*10^ROW(INDIRECT(\"1:\"&LEN(K37)))/10)))","v":""},"","",{"$f":"IF(AN37<>\"CV\",IF(AM37=\"CV\",LEFT(K37,5)&\"-\"&RIGHT(K37,4),\"\"),IF(LEN(K37)=5,TEXT(K37,\"#\"),IF(AN37=\"CV\",LEFT(K37,5)&\"-\"&RIGHT(K37,4),IF(AND(LEN(K37)=3,(COUNTIFS(Arrays!$I$3:$I$7,'Data Entry Worksheet'!#REF!,Arrays!$K$3:$K$7,LEFT(K37,1))+COUNTIFS(Arrays!$J$3:$J$7,'Data Entry Worksheet'!#REF!,Arrays!$K$3:$K$7,LEFT(K37,1)))>0),\"00\"&TEXT(K37,\"#\"),IF(AND(LEN(K37)=4,(COUNTIFS(Arrays!$M$3:$M$13,'Data Entry Worksheet'!#REF!,Arrays!$O$3:$O$13,LEFT(K37,1))+COUNTIFS(Arrays!$N$3:$N$13,'Data Entry Worksheet'!#REF!,Arrays!$O$3:$O$13,LEFT(K37,1)))>0),\"0\"&TEXT(K37,\"#\"),\"\")))))","v":""},{"$f":"IF(L37=\"\",\"\",IF(ISNA(MATCH(L37,Arrays!$G$3:$G$58,0)),IF(ISNA(MATCH(L37,Arrays!$H$3:$H$58,0)),\"NC\",\"CV\"),IF(EXACT(UPPER(L37),L37),\"C\",\"CV\")))","v":""},{"$f":"IF(AP37=\"CV\",IF(ISNA(MATCH(L37,Arrays!$G$3:$G$58,0)),INDEX(Arrays!$G$3:$H$58,MATCH(L37,Arrays!$H$3:$H$58,0),1),UPPER(L37)),\"\")","v":""},"","","","","",{"$f":"IF(O37=\"\",\"\",IF(ISNA(MATCH(O37,Arrays!$G$60:$G$65,0)),\"NC\",IF(EXACT(UPPER(O37),O37),\"C\",\"CV\")))","v":""},""]
["","","",null,null,null,null,null,null,null,null,null,null,null,null,"","","",null,"","","",{"$f":"IF(E38<>\"\",LEN(SUM(MID(0&E38,LARGE(ISNUMBER(--MID(E38,ROW(INDIRECT(\"1:\"&LEN(E38))),1))* ROW(INDIRECT(\"1:\"&LEN(E38))),ROW(INDIRECT(\"1:\"&LEN(E38))))+1,1)*10^ROW(INDIRECT(\"1:\"&LEN(E38)))/10)),\"\")","v":""},"","","","","","","","","","","","",{"$f":"IF(J38=\"\",\"\",IF(ISNA(MATCH(J38,Arrays!$G$3:$G$58,0)),IF(ISNA(MATCH(J38,Arrays!$H$3:$H$58,0)),\"NC\",\"CV\"),IF(EXACT(UPPER(J38),J38),\"C\",\"CV\")))","v":""},{"$f":"IF(AJ38=\"CV\",IF(ISNA(MATCH(J38,Arrays!$G$3:$G$58,0)),INDEX(Arrays!$G$3:$H$58,MATCH(J38,Arrays!$H$3:$H$58,0),1),UPPER(J38)),\"\")","v":""},{"$f":"IF(K38=\"\",\"\",LEN(SUM(MID(0&K38,LARGE(ISNUMBER(--MID(K38,ROW(INDIRECT(\"1:\"&LEN(K38))),1))* ROW(INDIRECT(\"1:\"&LEN(K38))),ROW(INDIRECT(\"1:\"&LEN(K38))))+1,1)*10^ROW(INDIRECT(\"1:\"&LEN(K38)))/10)))","v":""},"","",{"$f":"IF(AN38<>\"CV\",IF(AM38=\"CV\",LEFT(K38,5)&\"-\"&RIGHT(K38,4),\"\"),IF(LEN(K38)=5,TEXT(K38,\"#\"),IF(AN38=\"CV\",LEFT(K38,5)&\"-\"&RIGHT(K38,4),IF(AND(LEN(K38)=3,(COUNTIFS(Arrays!$I$3:$I$7,'Data Entry Worksheet'!#REF!,Arrays!$K$3:$K$7,LEFT(K38,1))+COUNTIFS(Arrays!$J$3:$J$7,'Data Entry Worksheet'!#REF!,Arrays!$K$3:$K$7,LEFT(K38,1)))>0),\"00\"&TEXT(K38,\"#\"),IF(AND(LEN(K38)=4,(COUNTIFS(Arrays!$M$3:$M$13,'Data Entry Worksheet'!#REF!,Arrays!$O$3:$O$13,LEFT(K38,1))+COUNTIFS(Arrays!$N$3:$N$13,'Data Entry Worksheet'!#REF!,Arrays!$O$3:$O$13,LEFT(K38,1)))>0),\"0\"&TEXT(K38,\"#\"),\"\")))))","v":""},{"$f":"IF(L38=\"\",\"\",IF(ISNA(MATCH(L38,Arrays!$G$3:$G$58,0)),IF(ISNA(MATCH(L38,Arrays!$H$3:$H$58,0)),\"NC\",\"CV\"),IF(EXACT(UPPER(L38),L38),\"C\",\"CV\")))","v":""},{"$f":"IF(AP38=\"CV\",IF(ISNA(MATCH(L38,Arrays!$G$3:$G$58,0)),INDEX(Arrays!$G$3:$H$58,MATCH(L38,Arrays!$H$3:$H$58,0),1),UPPER(L38)),\"\")","v":""},"","","","","",{"$f":"IF(O38=\"\",\"\",IF(ISNA(MATCH(O38,Arrays!$G$60:$G$65,0)),\"NC\",IF(EXACT(UPPER(O38),O38),\"C\",\"CV\")))","v":""},""]
["","","",null,null,null,null,null,null,null,null,null,null,null,null,"","","",null,"","","",{"$f":"IF(E39<>\"\",LEN(SUM(MID(0&E39,LARGE(ISNUMBER(--MID(E39,ROW(INDIRECT(\"1:\"&LEN(E39))),1))* ROW(INDIRECT(\"1:\"&LEN(E39))),ROW(INDIRECT(\"1:\"&LEN(E39))))+1,1)*10^ROW(INDIRECT(\"1:\"&LEN(E39)))/10)),\"\")","v":""},"","","","","","","","","","","","",{"$f":"IF(J39=\"\",\"\",IF(ISNA(MATCH(J39,Arrays!$G$3:$G$58,0)),IF(ISNA(MATCH(J39,Arrays!$H$3:$H$58,0)),\"NC\",\"CV\"),IF(EXACT(UPPER(J39),J39),\"C\",\"CV\")))","v":""},{"$f":"IF(AJ39=\"CV\",IF(ISNA(MATCH(J39,Arrays!$G$3:$G$58,0)),INDEX(Arrays!$G$3:$H$58,MATCH(J39,Arrays!$H$3:$H$58,0),1),UPPER(J39)),\"\")","v":""},{"$f":"IF(K39=\"\",\"\",LEN(SUM(MID(0&K39,LARGE(ISNUMBER(--MID(K39,ROW(INDIRECT(\"1:\"&LEN(K39))),1))* ROW(INDIRECT(\"1:\"&LEN(K39))),ROW(INDIRECT(\"1:\"&LEN(K39))))+1,1)*10^ROW(INDIRECT(\"1:\"&LEN(K39)))/10)))","v":""},"","",{"$f":"IF(AN39<>\"CV\",IF(AM39=\"CV\",LEFT(K39,5)&\"-\"&RIGHT(K39,4),\"\"),IF(LEN(K39)=5,TEXT(K39,\"#\"),IF(AN39=\"CV\",LEFT(K39,5)&\"-\"&RIGHT(K39,4),IF(AND(LEN(K39)=3,(COUNTIFS(Arrays!$I$3:$I$7,'Data Entry Worksheet'!#REF!,Arrays!$K$3:$K$7,LEFT(K39,1))+COUNTIFS(Arrays!$J$3:$J$7,'Data Entry Worksheet'!#REF!,Arrays!$K$3:$K$7,LEFT(K39,1)))>0),\"00\"&TEXT(K39,\"#\"),IF(AND(LEN(K39)=4,(COUNTIFS(Arrays!$M$3:$M$13,'Data Entry Worksheet'!#REF!,Arrays!$O$3:$O$13,LEFT(K39,1))+COUNTIFS(Arrays!$N$3:$N$13,'Data Entry Worksheet'!#REF!,Arrays!$O$3:$O$13,LEFT(K39,1)))>0),\"0\"&TEXT(K39,\"#\"),\"\")))))","v":""},{"$f":"IF(L39=\"\",\"\",IF(ISNA(MATCH(L39,Arrays!$G$3:$G$58,0)),IF(ISNA(MATCH(L39,Arrays!$H$3:$H$58,0)),\"NC\",\"CV\"),IF(EXACT(UPPER(L39),L39),\"C\",\"CV\")))","v":""},{"$f":"IF(AP39=\"CV\",IF(ISNA(MATCH(L39,Arrays!$G$3:$G$58,0)),INDEX(Arrays!$G$3:$H$58,MATCH(L39,Arrays!$H$3:$H$58,0),1),UPPER(L39)),\"\")","v":""},"","","","","",{"$f":"IF(O39=\"\",\"\",IF(ISNA(MATCH(O39,Arrays!$G$60:$G$65,0)),\"NC\",IF(EXACT(UPPER(O39),O39),\"C\",\"CV\")))","v":""},""]
["","","",null,null,null,null,null,null,null,null,null,null,null,null,"","","",null,"","","",{"$f":"IF(E40<>\"\",LEN(SUM(MID(0&E40,LARGE(ISNUMBER(--MID(E40,ROW(INDIRECT(\"1:\"&LEN(E40))),1))* ROW(INDIRECT(\"1:\"&LEN(E40))),ROW(INDIRECT(\"1:\"&LEN(E40))))+1,1)*10^ROW(INDIRECT(\"1:\"&LEN(E40)))/10)),\"\")","v":""},"","","","","","","","","","","","",{"$f":"IF(J40=\"\",\"\",IF(ISNA(MATCH(J40,Arrays!$G$3:$G$58,0)),IF(ISNA(MATCH(J40,Arrays!$H$3:$H$58,0)),\"NC\",\"CV\"),IF(EXACT(UPPER(J40),J40),\"C\",\"CV\")))","v":""},{"$f":"IF(AJ40=\"CV\",IF(ISNA(MATCH(J40,Arrays!$G$3:$G$58,0)),INDEX(Arrays!$G$3:$H$58,MATCH(J40,Arrays!$H$3:$H$58,0),1),UPPER(J40)),\"\")","v":""},{"$f":"IF(K40=\"\",\"\",LEN(SUM(MID(0&K40,LARGE(ISNUMBER(--MID(K40,ROW(INDIRECT(\"1:\"&LEN(K40))),1))* ROW(INDIRECT(\"1:\"&LEN(K40))),ROW(INDIRECT(\"1:\"&LEN(K40))))+1,1)*10^ROW(INDIRECT(\"1:\"&LEN(K40)))/10)))","v":""},"","",{"$f":"IF(AN40<>\"CV\",IF(AM40=\"CV\",LEFT(K40,5)&\"-\"&RIGHT(K40,4),\"\"),IF(LEN(K40)=5,TEXT(K40,\"#\"),IF(AN40=\"CV\",LEFT(K40,5)&\"-\"&RIGHT(K40,4),IF(AND(LEN(K40)=3,(COUNTIFS(Arrays!$I$3:$I$7,'Data Entry Worksheet'!#REF!,Arrays!$K$3:$K$7,LEFT(K40,1))+COUNTIFS(Arrays!$J$3:$J$7,'Data Entry Worksheet'!#REF!,Arrays!$K$3:$K$7,LEFT(K40,1)))>0),\"00\"&TEXT(K40,\"#\"),IF(AND(LEN(K40)=4,(COUNTIFS(Arrays!$M$3:$M$13,'Data Entry Worksheet'!#REF!,Arrays!$O$3:$O$13,LEFT(K40,1))+COUNTIFS(Arrays!$N$3:$N$13,'Data Entry Worksheet'!#REF!,Arrays!$O$3:$O$13,LEFT(K40,1)))>0),\"0\"&TEXT(K40,\"#\"),\"\")))))","v":""},{"$f":"IF(L40=\"\",\"\",IF(ISNA(MATCH(L40,Arrays!$G$3:$G$58,0)),IF(ISNA(MATCH(L40,Arrays!$H$3:$H$58,0)),\"NC\",\"CV\"),IF(EXACT(UPPER(L40),L40),\"C\",\"CV\")))","v":""},{"$f":"IF(AP40=\"CV\",IF(ISNA(MATCH(L40,Arrays!$G$3:$G$58,0)),INDEX(Arrays!$G$3:$H$58,MATCH(L40,Arrays!$H$3:$H$58,0),1),UPPER(L40)),\"\")","v":""},"","","","","",{"$f":"IF(O40=\"\",\"\",IF(ISNA(MATCH(O40,Arrays!$G$60:$G$65,0)),\"NC\",IF(EXACT(UPPER(O40),O40),\"C\",\"CV\")))","v":""},""]
["","","",null,null,null,null,null,null,null,null,null,null,null,null,"","","",null,"","","",{"$f":"IF(E41<>\"\",LEN(SUM(MID(0&E41,LARGE(ISNUMBER(--MID(E41,ROW(INDIRECT(\"1:\"&LEN(E41))),1))* ROW(INDIRECT(\"1:\"&LEN(E41))),ROW(INDIRECT(\"1:\"&LEN(E41))))+1,1)*10^ROW(INDIRECT(\"1:\"&LEN(E41)))/10)),\"\")","v":""},"","","","","","","","","","","","",{"$f":"IF(J41=\"\",\"\",IF(ISNA(MATCH(J41,Arrays!$G$3:$G$58,0)),IF(ISNA(MATCH(J41,Arrays!$H$3:$H$58,0)),\"NC\",\"CV\"),IF(EXACT(UPPER(J41),J41),\"C\",\"CV\")))","v":""},{"$f":"IF(AJ41=\"CV\",IF(ISNA(MATCH(J41,Arrays!$G$3:$G$58,0)),INDEX(Arrays!$G$3:$H$58,MATCH(J41,Arrays!$H$3:$H$58,0),1),UPPER(J41)),\"\")","v":""},{"$f":"IF(K41=\"\",\"\",LEN(SUM(MID(0&K41,LARGE(ISNUMBER(--MID(K41,ROW(INDIRECT(\"1:\"&LEN(K41))),1))* ROW(INDIRECT(\"1:\"&LEN(K41))),ROW(INDIRECT(\"1:\"&LEN(K41))))+1,1)*10^ROW(INDIRECT(\"1:\"&LEN(K41)))/10)))","v":""},"","",{"$f":"IF(AN41<>\"CV\",IF(AM41=\"CV\",LEFT(K41,5)&\"-\"&RIGHT(K41,4),\"\"),IF(LEN(K41)=5,TEXT(K41,\"#\"),IF(AN41=\"CV\",LEFT(K41,5)&\"-\"&RIGHT(K41,4),IF(AND(LEN(K41)=3,(COUNTIFS(Arrays!$I$3:$I$7,'Data Entry Worksheet'!#REF!,Arrays!$K$3:$K$7,LEFT(K41,1))+COUNTIFS(Arrays!$J$3:$J$7,'Data Entry Worksheet'!#REF!,Arrays!$K$3:$K$7,LEFT(K41,1)))>0),\"00\"&TEXT(K41,\"#\"),IF(AND(LEN(K41)=4,(COUNTIFS(Arrays!$M$3:$M$13,'Data Entry Worksheet'!#REF!,Arrays!$O$3:$O$13,LEFT(K41,1))+COUNTIFS(Arrays!$N$3:$N$13,'Data Entry Worksheet'!#REF!,Arrays!$O$3:$O$13,LEFT(K41,1)))>0),\"0\"&TEXT(K41,\"#\"),\"\")))))","v":""},{"$f":"IF(L41=\"\",\"\",IF(ISNA(MATCH(L41,Arrays!$G$3:$G$58,0)),IF(ISNA(MATCH(L41,Arrays!$H$3:$H$58,0)),\"NC\",\"CV\"),IF(EXACT(UPPER(L41),L41),\"C\",\"CV\")))","v":""},{"$f":"IF(AP41=\"CV\",IF(ISNA(MATCH(L41,Arrays!$G$3:$G$58,0)),INDEX(Arrays!$G$3:$H$58,MATCH(L41,Arrays!$H$3:$H$58,0),1),UPPER(L41)),\"\")","v":""},"","","","","",{"$f":"IF(O41=\"\",\"\",IF(ISNA(MATCH(O41,Arrays!$G$60:$G$65,0)),\"NC\",IF(EXACT(UPPER(O41),O41),\"C\",\"CV\")))","v":""},""]
["","","",null,null,null,null,null,null,null,null,null,null,null,null,"","","",null,"","","",{"$f":"IF(E42<>\"\",LEN(SUM(MID(0&E42,LARGE(ISNUMBER(--MID(E42,ROW(INDIRECT(\"1:\"&LEN(E42))),1))* ROW(INDIRECT(\"1:\"&LEN(E42))),ROW(INDIRECT(\"1:\"&LEN(E42))))+1,1)*10^ROW(INDIRECT(\"1:\"&LEN(E42)))/10)),\"\")","v":""},"","","","","","","","","","","","",{"$f":"IF(J42=\"\",\"\",IF(ISNA(MATCH(J42,Arrays!$G$3:$G$58,0)),IF(ISNA(MATCH(J42,Arrays!$H$3:$H$58,0)),\"NC\",\"CV\"),IF(EXACT(UPPER(J42),J42),\"C\",\"CV\")))","v":""},{"$f":"IF(AJ42=\"CV\",IF(ISNA(MATCH(J42,Arrays!$G$3:$G$58,0)),INDEX(Arrays!$G$3:$H$58,MATCH(J42,Arrays!$H$3:$H$58,0),1),UPPER(J42)),\"\")","v":""},{"$f":"IF(K42=\"\",\"\",LEN(SUM(MID(0&K42,LARGE(ISNUMBER(--MID(K42,ROW(INDIRECT(\"1:\"&LEN(K42))),1))* ROW(INDIRECT(\"1:\"&LEN(K42))),ROW(INDIRECT(\"1:\"&LEN(K42))))+1,1)*10^ROW(INDIRECT(\"1:\"&LEN(K42)))/10)))","v":""},"","",{"$f":"IF(AN42<>\"CV\",IF(AM42=\"CV\",LEFT(K42,5)&\"-\"&RIGHT(K42,4),\"\"),IF(LEN(K42)=5,TEXT(K42,\"#\"),IF(AN42=\"CV\",LEFT(K42,5)&\"-\"&RIGHT(K42,4),IF(AND(LEN(K42)=3,(COUNTIFS(Arrays!$I$3:$I$7,'Data Entry Worksheet'!#REF!,Arrays!$K$3:$K$7,LEFT(K42,1))+COUNTIFS(Arrays!$J$3:$J$7,'Data Entry Worksheet'!#REF!,Arrays!$K$3:$K$7,LEFT(K42,1)))>0),\"00\"&TEXT(K42,\"#\"),IF(AND(LEN(K42)=4,(COUNTIFS(Arrays!$M$3:$M$13,'Data Entry Worksheet'!#REF!,Arrays!$O$3:$O$13,LEFT(K42,1))+COUNTIFS(Arrays!$N$3:$N$13,'Data Entry Worksheet'!#REF!,Arrays!$O$3:$O$13,LEFT(K42,1)))>0),\"0\"&TEXT(K42,\"#\"),\"\")))))","v":""},{"$f":"IF(L42=\"\",\"\",IF(ISNA(MATCH(L42,Arrays!$G$3:$G$58,0)),IF(ISNA(MATCH(L42,Arrays!$H$3:$H$58,0)),\"NC\",\"CV\"),IF(EXACT(UPPER(L42),L42),\"C\",\"CV\")))","v":""},{"$f":"IF(AP42=\"CV\",IF(ISNA(MATCH(L42,Arrays!$G$3:$G$58,0)),INDEX(Arrays!$G$3:$H$58,MATCH(L42,Arrays!$H$3:$H$58,0),1),UPPER(L42)),\"\")","v":""},"","","","","",{"$f":"IF(O42=\"\",\"\",IF(ISNA(MATCH(O42,Arrays!$G$60:$G$65,0)),\"NC\",IF(EXACT(UPPER(O42),O42),\"C\",\"CV\")))","v":""},""]
["","","",null,null,null,null,null,null,null,null,null,null,null,null,"","","",null,"","","",{"$f":"IF(E43<>\"\",LEN(SUM(MID(0&E43,LARGE(ISNUMBER(--MID(E43,ROW(INDIRECT(\"1:\"&LEN(E43))),1))* ROW(INDIRECT(\"1:\"&LEN(E43))),ROW(INDIRECT(\"1:\"&LEN(E43))))+1,1)*10^ROW(INDIRECT(\"1:\"&LEN(E43)))/10)),\"\")","v":""},"","","","","","","","","","","","",{"$f":"IF(J43=\"\",\"\",IF(ISNA(MATCH(J43,Arrays!$G$3:$G$58,0)),IF(ISNA(MATCH(J43,Arrays!$H$3:$H$58,0)),\"NC\",\"CV\"),IF(EXACT(UPPER(J43),J43),\"C\",\"CV\")))","v":""},{"$f":"IF(AJ43=\"CV\",IF(ISNA(MATCH(J43,Arrays!$G$3:$G$58,0)),INDEX(Arrays!$G$3:$H$58,MATCH(J43,Arrays!$H$3:$H$58,0),1),UPPER(J43)),\"\")","v":""},{"$f":"IF(K43=\"\",\"\",LEN(SUM(MID(0&K43,LARGE(ISNUMBER(--MID(K43,ROW(INDIRECT(\"1:\"&LEN(K43))),1))* ROW(INDIRECT(\"1:\"&LEN(K43))),ROW(INDIRECT(\"1:\"&LEN(K43))))+1,1)*10^ROW(INDIRECT(\"1:\"&LEN(K43)))/10)))","v":""},"","",{"$f":"IF(AN43<>\"CV\",IF(AM43=\"CV\",LEFT(K43,5)&\"-\"&RIGHT(K43,4),\"\"),IF(LEN(K43)=5,TEXT(K43,\"#\"),IF(AN43=\"CV\",LEFT(K43,5)&\"-\"&RIGHT(K43,4),IF(AND(LEN(K43)=3,(COUNTIFS(Arrays!$I$3:$I$7,'Data Entry Worksheet'!#REF!,Arrays!$K$3:$K$7,LEFT(K43,1))+COUNTIFS(Arrays!$J$3:$J$7,'Data Entry Worksheet'!#REF!,Arrays!$K$3:$K$7,LEFT(K43,1)))>0),\"00\"&TEXT(K43,\"#\"),IF(AND(LEN(K43)=4,(COUNTIFS(Arrays!$M$3:$M$13,'Data Entry Worksheet'!#REF!,Arrays!$O$3:$O$13,LEFT(K43,1))+COUNTIFS(Arrays!$N$3:$N$13,'Data Entry Worksheet'!#REF!,Arrays!$O$3:$O$13,LEFT(K43,1)))>0),\"0\"&TEXT(K43,\"#\"),\"\")))))","v":""},{"$f":"IF(L43=\"\",\"\",IF(ISNA(MATCH(L43,Arrays!$G$3:$G$58,0)),IF(ISNA(MATCH(L43,Arrays!$H$3:$H$58,0)),\"NC\",\"CV\"),IF(EXACT(UPPER(L43),L43),\"C\",\"CV\")))","v":""},{"$f":"IF(AP43=\"CV\",IF(ISNA(MATCH(L43,Arrays!$G$3:$G$58,0)),INDEX(Arrays!$G$3:$H$58,MATCH(L43,Arrays!$H$3:$H$58,0),1),UPPER(L43)),\"\")","v":""},"","","","","",{"$f":"IF(O43=\"\",\"\",IF(ISNA(MATCH(O43,Arrays!$G$60:$G$65,0)),\"NC\",IF(EXACT(UPPER(O43),O43),\"C\",\"CV\")))","v":""},""]
["","","",null,null,null,null,null,null,null,null,null,null,null,null,"","","",null,"","","",{"$f":"IF(E44<>\"\",LEN(SUM(MID(0&E44,LARGE(ISNUMBER(--MID(E44,ROW(INDIRECT(\"1:\"&LEN(E44))),1))* ROW(INDIRECT(\"1:\"&LEN(E44))),ROW(INDIRECT(\"1:\"&LEN(E44))))+1,1)*10^ROW(INDIRECT(\"1:\"&LEN(E44)))/10)),\"\")","v":""},"","","","","","","","","","","","",{"$f":"IF(J44=\"\",\"\",IF(ISNA(MATCH(J44,Arrays!$G$3:$G$58,0)),IF(ISNA(MATCH(J44,Arrays!$H$3:$H$58,0)),\"NC\",\"CV\"),IF(EXACT(UPPER(J44),J44),\"C\",\"CV\")))","v":""},{"$f":"IF(AJ44=\"CV\",IF(ISNA(MATCH(J44,Arrays!$G$3:$G$58,0)),INDEX(Arrays!$G$3:$H$58,MATCH(J44,Arrays!$H$3:$H$58,0),1),UPPER(J44)),\"\")","v":""},{"$f":"IF(K44=\"\",\"\",LEN(SUM(MID(0&K44,LARGE(ISNUMBER(--MID(K44,ROW(INDIRECT(\"1:\"&LEN(K44))),1))* ROW(INDIRECT(\"1:\"&LEN(K44))),ROW(INDIRECT(\"1:\"&LEN(K44))))+1,1)*10^ROW(INDIRECT(\"1:\"&LEN(K44)))/10)))","v":""},"","",{"$f":"IF(AN44<>\"CV\",IF(AM44=\"CV\",LEFT(K44,5)&\"-\"&RIGHT(K44,4),\"\"),IF(LEN(K44)=5,TEXT(K44,\"#\"),IF(AN44=\"CV\",LEFT(K44,5)&\"-\"&RIGHT(K44,4),IF(AND(LEN(K44)=3,(COUNTIFS(Arrays!$I$3:$I$7,'Data Entry Worksheet'!#REF!,Arrays!$K$3:$K$7,LEFT(K44,1))+COUNTIFS(Arrays!$J$3:$J$7,'Data Entry Worksheet'!#REF!,Arrays!$K$3:$K$7,LEFT(K44,1)))>0),\"00\"&TEXT(K44,\"#\"),IF(AND(LEN(K44)=4,(COUNTIFS(Arrays!$M$3:$M$13,'Data Entry Worksheet'!#REF!,Arrays!$O$3:$O$13,LEFT(K44,1))+COUNTIFS(Arrays!$N$3:$N$13,'Data Entry Worksheet'!#REF!,Arrays!$O$3:$O$13,LEFT(K44,1)))>0),\"0\"&TEXT(K44,\"#\"),\"\")))))","v":""},{"$f":"IF(L44=\"\",\"\",IF(ISNA(MATCH(L44,Arrays!$G$3:$G$58,0)),IF(ISNA(MATCH(L44,Arrays!$H$3:$H$58,0)),\"NC\",\"CV\"),IF(EXACT(UPPER(L44),L44),\"C\",\"CV\")))","v":""},{"$f":"IF(AP44=\"CV\",IF(ISNA(MATCH(L44,Arrays!$G$3:$G$58,0)),INDEX(Arrays!$G$3:$H$58,MATCH(L44,Arrays!$H$3:$H$58,0),1),UPPER(L44)),\"\")","v":""},"","","","","",{"$f":"IF(O44=\"\",\"\",IF(ISNA(MATCH(O44,Arrays!$G$60:$G$65,0)),\"NC\",IF(EXACT(UPPER(O44),O44),\"C\",\"CV\")))","v":""},""]
["","","",null,null,null,null,null,null,null,null,null,null,null,null,"","","",null,"","","",{"$f":"IF(E45<>\"\",LEN(SUM(MID(0&E45,LARGE(ISNUMBER(--MID(E45,ROW(INDIRECT(\"1:\"&LEN(E45))),1))* ROW(INDIRECT(\"1:\"&LEN(E45))),ROW(INDIRECT(\"1:\"&LEN(E45))))+1,1)*10^ROW(INDIRECT(\"1:\"&LEN(E45)))/10)),\"\")","v":""},"","","","","","","","","","","","",{"$f":"IF(J45=\"\",\"\",IF(ISNA(MATCH(J45,Arrays!$G$3:$G$58,0)),IF(ISNA(MATCH(J45,Arrays!$H$3:$H$58,0)),\"NC\",\"CV\"),IF(EXACT(UPPER(J45),J45),\"C\",\"CV\")))","v":""},{"$f":"IF(AJ45=\"CV\",IF(ISNA(MATCH(J45,Arrays!$G$3:$G$58,0)),INDEX(Arrays!$G$3:$H$58,MATCH(J45,Arrays!$H$3:$H$58,0),1),UPPER(J45)),\"\")","v":""},{"$f":"IF(K45=\"\",\"\",LEN(SUM(MID(0&K45,LARGE(ISNUMBER(--MID(K45,ROW(INDIRECT(\"1:\"&LEN(K45))),1))* ROW(INDIRECT(\"1:\"&LEN(K45))),ROW(INDIRECT(\"1:\"&LEN(K45))))+1,1)*10^ROW(INDIRECT(\"1:\"&LEN(K45)))/10)))","v":""},"","",{"$f":"IF(AN45<>\"CV\",IF(AM45=\"CV\",LEFT(K45,5)&\"-\"&RIGHT(K45,4),\"\"),IF(LEN(K45)=5,TEXT(K45,\"#\"),IF(AN45=\"CV\",LEFT(K45,5)&\"-\"&RIGHT(K45,4),IF(AND(LEN(K45)=3,(COUNTIFS(Arrays!$I$3:$I$7,'Data Entry Worksheet'!#REF!,Arrays!$K$3:$K$7,LEFT(K45,1))+COUNTIFS(Arrays!$J$3:$J$7,'Data Entry Worksheet'!#REF!,Arrays!$K$3:$K$7,LEFT(K45,1)))>0),\"00\"&TEXT(K45,\"#\"),IF(AND(LEN(K45)=4,(COUNTIFS(Arrays!$M$3:$M$13,'Data Entry Worksheet'!#REF!,Arrays!$O$3:$O$13,LEFT(K45,1))+COUNTIFS(Arrays!$N$3:$N$13,'Data Entry Worksheet'!#REF!,Arrays!$O$3:$O$13,LEFT(K45,1)))>0),\"0\"&TEXT(K45,\"#\"),\"\")))))","v":""},{"$f":"IF(L45=\"\",\"\",IF(ISNA(MATCH(L45,Arrays!$G$3:$G$58,0)),IF(ISNA(MATCH(L45,Arrays!$H$3:$H$58,0)),\"NC\",\"CV\"),IF(EXACT(UPPER(L45),L45),\"C\",\"CV\")))","v":""},{"$f":"IF(AP45=\"CV\",IF(ISNA(MATCH(L45,Arrays!$G$3:$G$58,0)),INDEX(Arrays!$G$3:$H$58,MATCH(L45,Arrays!$H$3:$H$58,0),1),UPPER(L45)),\"\")","v":""},"","","","","",{"$f":"IF(O45=\"\",\"\",IF(ISNA(MATCH(O45,Arrays!$G$60:$G$65,0)),\"NC\",IF(EXACT(UPPER(O45),O45),\"C\",\"CV\")))","v":""},""]
["","","",null,null,null,null,null,null,null,null,null,null,null,null,"","","",null,"","","",{"$f":"IF(E46<>\"\",LEN(SUM(MID(0&E46,LARGE(ISNUMBER(--MID(E46,ROW(INDIRECT(\"1:\"&LEN(E46))),1))* ROW(INDIRECT(\"1:\"&LEN(E46))),ROW(INDIRECT(\"1:\"&LEN(E46))))+1,1)*10^ROW(INDIRECT(\"1:\"&LEN(E46)))/10)),\"\")","v":""},"","","","","","","","","","","","",{"$f":"IF(J46=\"\",\"\",IF(ISNA(MATCH(J46,Arrays!$G$3:$G$58,0)),IF(ISNA(MATCH(J46,Arrays!$H$3:$H$58,0)),\"NC\",\"CV\"),IF(EXACT(UPPER(J46),J46),\"C\",\"CV\")))","v":""},{"$f":"IF(AJ46=\"CV\",IF(ISNA(MATCH(J46,Arrays!$G$3:$G$58,0)),INDEX(Arrays!$G$3:$H$58,MATCH(J46,Arrays!$H$3:$H$58,0),1),UPPER(J46)),\"\")","v":""},{"$f":"IF(K46=\"\",\"\",LEN(SUM(MID(0&K46,LARGE(ISNUMBER(--MID(K46,ROW(INDIRECT(\"1:\"&LEN(K46))),1))* ROW(INDIRECT(\"1:\"&LEN(K46))),ROW(INDIRECT(\"1:\"&LEN(K46))))+1,1)*10^ROW(INDIRECT(\"1:\"&LEN(K46)))/10)))","v":""},"","",{"$f":"IF(AN46<>\"CV\",IF(AM46=\"CV\",LEFT(K46,5)&\"-\"&RIGHT(K46,4),\"\"),IF(LEN(K46)=5,TEXT(K46,\"#\"),IF(AN46=\"CV\",LEFT(K46,5)&\"-\"&RIGHT(K46,4),IF(AND(LEN(K46)=3,(COUNTIFS(Arrays!$I$3:$I$7,'Data Entry Worksheet'!#REF!,Arrays!$K$3:$K$7,LEFT(K46,1))+COUNTIFS(Arrays!$J$3:$J$7,'Data Entry Worksheet'!#REF!,Arrays!$K$3:$K$7,LEFT(K46,1)))>0),\"00\"&TEXT(K46,\"#\"),IF(AND(LEN(K46)=4,(COUNTIFS(Arrays!$M$3:$M$13,'Data Entry Worksheet'!#REF!,Arrays!$O$3:$O$13,LEFT(K46,1))+COUNTIFS(Arrays!$N$3:$N$13,'Data Entry Worksheet'!#REF!,Arrays!$O$3:$O$13,LEFT(K46,1)))>0),\"0\"&TEXT(K46,\"#\"),\"\")))))","v":""},{"$f":"IF(L46=\"\",\"\",IF(ISNA(MATCH(L46,Arrays!$G$3:$G$58,0)),IF(ISNA(MATCH(L46,Arrays!$H$3:$H$58,0)),\"NC\",\"CV\"),IF(EXACT(UPPER(L46),L46),\"C\",\"CV\")))","v":""},{"$f":"IF(AP46=\"CV\",IF(ISNA(MATCH(L46,Arrays!$G$3:$G$58,0)),INDEX(Arrays!$G$3:$H$58,MATCH(L46,Arrays!$H$3:$H$58,0),1),UPPER(L46)),\"\")","v":""},"","","","","",{"$f":"IF(O46=\"\",\"\",IF(ISNA(MATCH(O46,Arrays!$G$60:$G$65,0)),\"NC\",IF(EXACT(UPPER(O46),O46),\"C\",\"CV\")))","v":""},""]
["","","",null,null,null,null,null,null,null,null,null,null,null,null,"","","",null,"","","",{"$f":"IF(E47<>\"\",LEN(SUM(MID(0&E47,LARGE(ISNUMBER(--MID(E47,ROW(INDIRECT(\"1:\"&LEN(E47))),1))* ROW(INDIRECT(\"1:\"&LEN(E47))),ROW(INDIRECT(\"1:\"&LEN(E47))))+1,1)*10^ROW(INDIRECT(\"1:\"&LEN(E47)))/10)),\"\")","v":""},"","","","","","","","","","","","",{"$f":"IF(J47=\"\",\"\",IF(ISNA(MATCH(J47,Arrays!$G$3:$G$58,0)),IF(ISNA(MATCH(J47,Arrays!$H$3:$H$58,0)),\"NC\",\"CV\"),IF(EXACT(UPPER(J47),J47),\"C\",\"CV\")))","v":""},{"$f":"IF(AJ47=\"CV\",IF(ISNA(MATCH(J47,Arrays!$G$3:$G$58,0)),INDEX(Arrays!$G$3:$H$58,MATCH(J47,Arrays!$H$3:$H$58,0),1),UPPER(J47)),\"\")","v":""},{"$f":"IF(K47=\"\",\"\",LEN(SUM(MID(0&K47,LARGE(ISNUMBER(--MID(K47,ROW(INDIRECT(\"1:\"&LEN(K47))),1))* ROW(INDIRECT(\"1:\"&LEN(K47))),ROW(INDIRECT(\"1:\"&LEN(K47))))+1,1)*10^ROW(INDIRECT(\"1:\"&LEN(K47)))/10)))","v":""},"","",{"$f":"IF(AN47<>\"CV\",IF(AM47=\"CV\",LEFT(K47,5)&\"-\"&RIGHT(K47,4),\"\"),IF(LEN(K47)=5,TEXT(K47,\"#\"),IF(AN47=\"CV\",LEFT(K47,5)&\"-\"&RIGHT(K47,4),IF(AND(LEN(K47)=3,(COUNTIFS(Arrays!$I$3:$I$7,'Data Entry Worksheet'!#REF!,Arrays!$K$3:$K$7,LEFT(K47,1))+COUNTIFS(Arrays!$J$3:$J$7,'Data Entry Worksheet'!#REF!,Arrays!$K$3:$K$7,LEFT(K47,1)))>0),\"00\"&TEXT(K47,\"#\"),IF(AND(LEN(K47)=4,(COUNTIFS(Arrays!$M$3:$M$13,'Data Entry Worksheet'!#REF!,Arrays!$O$3:$O$13,LEFT(K47,1))+COUNTIFS(Arrays!$N$3:$N$13,'Data Entry Worksheet'!#REF!,Arrays!$O$3:$O$13,LEFT(K47,1)))>0),\"0\"&TEXT(K47,\"#\"),\"\")))))","v":""},{"$f":"IF(L47=\"\",\"\",IF(ISNA(MATCH(L47,Arrays!$G$3:$G$58,0)),IF(ISNA(MATCH(L47,Arrays!$H$3:$H$58,0)),\"NC\",\"CV\"),IF(EXACT(UPPER(L47),L47),\"C\",\"CV\")))","v":""},{"$f":"IF(AP47=\"CV\",IF(ISNA(MATCH(L47,Arrays!$G$3:$G$58,0)),INDEX(Arrays!$G$3:$H$58,MATCH(L47,Arrays!$H$3:$H$58,0),1),UPPER(L47)),\"\")","v":""},"","","","","",{"$f":"IF(O47=\"\",\"\",IF(ISNA(MATCH(O47,Arrays!$G$60:$G$65,0)),\"NC\",IF(EXACT(UPPER(O47),O47),\"C\",\"CV\")))","v":""},""]
["","","",null,null,null,null,null,null,null,null,null,null,null,null,"","","",null,"","","",{"$f":"IF(E48<>\"\",LEN(SUM(MID(0&E48,LARGE(ISNUMBER(--MID(E48,ROW(INDIRECT(\"1:\"&LEN(E48))),1))* ROW(INDIRECT(\"1:\"&LEN(E48))),ROW(INDIRECT(\"1:\"&LEN(E48))))+1,1)*10^ROW(INDIRECT(\"1:\"&LEN(E48)))/10)),\"\")","v":""},"","","","","","","","","","","","",{"$f":"IF(J48=\"\",\"\",IF(ISNA(MATCH(J48,Arrays!$G$3:$G$58,0)),IF(ISNA(MATCH(J48,Arrays!$H$3:$H$58,0)),\"NC\",\"CV\"),IF(EXACT(UPPER(J48),J48),\"C\",\"CV\")))","v":""},{"$f":"IF(AJ48=\"CV\",IF(ISNA(MATCH(J48,Arrays!$G$3:$G$58,0)),INDEX(Arrays!$G$3:$H$58,MATCH(J48,Arrays!$H$3:$H$58,0),1),UPPER(J48)),\"\")","v":""},{"$f":"IF(K48=\"\",\"\",LEN(SUM(MID(0&K48,LARGE(ISNUMBER(--MID(K48,ROW(INDIRECT(\"1:\"&LEN(K48))),1))* ROW(INDIRECT(\"1:\"&LEN(K48))),ROW(INDIRECT(\"1:\"&LEN(K48))))+1,1)*10^ROW(INDIRECT(\"1:\"&LEN(K48)))/10)))","v":""},"","",{"$f":"IF(AN48<>\"CV\",IF(AM48=\"CV\",LEFT(K48,5)&\"-\"&RIGHT(K48,4),\"\"),IF(LEN(K48)=5,TEXT(K48,\"#\"),IF(AN48=\"CV\",LEFT(K48,5)&\"-\"&RIGHT(K48,4),IF(AND(LEN(K48)=3,(COUNTIFS(Arrays!$I$3:$I$7,'Data Entry Worksheet'!#REF!,Arrays!$K$3:$K$7,LEFT(K48,1))+COUNTIFS(Arrays!$J$3:$J$7,'Data Entry Worksheet'!#REF!,Arrays!$K$3:$K$7,LEFT(K48,1)))>0),\"00\"&TEXT(K48,\"#\"),IF(AND(LEN(K48)=4,(COUNTIFS(Arrays!$M$3:$M$13,'Data Entry Worksheet'!#REF!,Arrays!$O$3:$O$13,LEFT(K48,1))+COUNTIFS(Arrays!$N$3:$N$13,'Data Entry Worksheet'!#REF!,Arrays!$O$3:$O$13,LEFT(K48,1)))>0),\"0\"&TEXT(K48,\"#\"),\"\")))))","v":""},{"$f":"IF(L48=\"\",\"\",IF(ISNA(MATCH(L48,Arrays!$G$3:$G$58,0)),IF(ISNA(MATCH(L48,Arrays!$H$3:$H$58,0)),\"NC\",\"CV\"),IF(EXACT(UPPER(L48),L48),\"C\",\"CV\")))","v":""},{"$f":"IF(AP48=\"CV\",IF(ISNA(MATCH(L48,Arrays!$G$3:$G$58,0)),INDEX(Arrays!$G$3:$H$58,MATCH(L48,Arrays!$H$3:$H$58,0),1),UPPER(L48)),\"\")","v":""},"","","","","",{"$f":"IF(O48=\"\",\"\",IF(ISNA(MATCH(O48,Arrays!$G$60:$G$65,0)),\"NC\",IF(EXACT(UPPER(O48),O48),\"C\",\"CV\")))","v":""},""]
["","","",null,null,null,null,null,null,null,null,null,null,null,null,"","","",null,"","","",{"$f":"IF(E49<>\"\",LEN(SUM(MID(0&E49,LARGE(ISNUMBER(--MID(E49,ROW(INDIRECT(\"1:\"&LEN(E49))),1))* ROW(INDIRECT(\"1:\"&LEN(E49))),ROW(INDIRECT(\"1:\"&LEN(E49))))+1,1)*10^ROW(INDIRECT(\"1:\"&LEN(E49)))/10)),\"\")","v":""},"","","","","","","","","","","","",{"$f":"IF(J49=\"\",\"\",IF(ISNA(MATCH(J49,Arrays!$G$3:$G$58,0)),IF(ISNA(MATCH(J49,Arrays!$H$3:$H$58,0)),\"NC\",\"CV\"),IF(EXACT(UPPER(J49),J49),\"C\",\"CV\")))","v":""},{"$f":"IF(AJ49=\"CV\",IF(ISNA(MATCH(J49,Arrays!$G$3:$G$58,0)),INDEX(Arrays!$G$3:$H$58,MATCH(J49,Arrays!$H$3:$H$58,0),1),UPPER(J49)),\"\")","v":""},{"$f":"IF(K49=\"\",\"\",LEN(SUM(MID(0&K49,LARGE(ISNUMBER(--MID(K49,ROW(INDIRECT(\"1:\"&LEN(K49))),1))* ROW(INDIRECT(\"1:\"&LEN(K49))),ROW(INDIRECT(\"1:\"&LEN(K49))))+1,1)*10^ROW(INDIRECT(\"1:\"&LEN(K49)))/10)))","v":""},"","",{"$f":"IF(AN49<>\"CV\",IF(AM49=\"CV\",LEFT(K49,5)&\"-\"&RIGHT(K49,4),\"\"),IF(LEN(K49)=5,TEXT(K49,\"#\"),IF(AN49=\"CV\",LEFT(K49,5)&\"-\"&RIGHT(K49,4),IF(AND(LEN(K49)=3,(COUNTIFS(Arrays!$I$3:$I$7,'Data Entry Worksheet'!#REF!,Arrays!$K$3:$K$7,LEFT(K49,1))+COUNTIFS(Arrays!$J$3:$J$7,'Data Entry Worksheet'!#REF!,Arrays!$K$3:$K$7,LEFT(K49,1)))>0),\"00\"&TEXT(K49,\"#\"),IF(AND(LEN(K49)=4,(COUNTIFS(Arrays!$M$3:$M$13,'Data Entry Worksheet'!#REF!,Arrays!$O$3:$O$13,LEFT(K49,1))+COUNTIFS(Arrays!$N$3:$N$13,'Data Entry Worksheet'!#REF!,Arrays!$O$3:$O$13,LEFT(K49,1)))>0),\"0\"&TEXT(K49,\"#\"),\"\")))))","v":""},{"$f":"IF(L49=\"\",\"\",IF(ISNA(MATCH(L49,Arrays!$G$3:$G$58,0)),IF(ISNA(MATCH(L49,Arrays!$H$3:$H$58,0)),\"NC\",\"CV\"),IF(EXACT(UPPER(L49),L49),\"C\",\"CV\")))","v":""},{"$f":"IF(AP49=\"CV\",IF(ISNA(MATCH(L49,Arrays!$G$3:$G$58,0)),INDEX(Arrays!$G$3:$H$58,MATCH(L49,Arrays!$H$3:$H$58,0),1),UPPER(L49)),\"\")","v":""},"","","","","",{"$f":"IF(O49=\"\",\"\",IF(ISNA(MATCH(O49,Arrays!$G$60:$G$65,0)),\"NC\",IF(EXACT(UPPER(O49),O49),\"C\",\"CV\")))","v":""},""]
["","","",null,null,null,null,null,null,null,null,null,null,null,null,{"$f":"IF(ISNA(MATCH(MAX(A:A),A:A,0)),\"\",IF(COUNTIF(D50:O50,\"\")=12,IF(ROW()<MATCH(MAX(A:A),A:A,0),\"Blank\",\"\"),IF(COUNTA(D50:G50)+COUNTA(I50:O50)=11,\"Complete\",\"Incomplete\")))","v":""},{"$f":"IF(COUNTIF(D50:O50,\"\")<>12,IF(COUNTIF(E:E,E50)=1,\"Unique\",IF(E50=\"\",\"No TIN Entered\",\"Duplicate\")),\"\")","v":""},"",null,"","","",{"$f":"IF(E50<>\"\",LEN(SUM(MID(0&E50,LARGE(ISNUMBER(--MID(E50,ROW(INDIRECT(\"1:\"&LEN(E50))),1))* ROW(INDIRECT(\"1:\"&LEN(E50))),ROW(INDIRECT(\"1:\"&LEN(E50))))+1,1)*10^ROW(INDIRECT(\"1:\"&LEN(E50)))/10)),\"\")","v":""},"","","","","","","","","","","","",{"$f":"IF(J50=\"\",\"\",IF(ISNA(MATCH(J50,Arrays!$G$3:$G$58,0)),IF(ISNA(MATCH(J50,Arrays!$H$3:$H$58,0)),\"NC\",\"CV\"),IF(EXACT(UPPER(J50),J50),\"C\",\"CV\")))","v":""},{"$f":"IF(AJ50=\"CV\",IF(ISNA(MATCH(J50,Arrays!$G$3:$G$58,0)),INDEX(Arrays!$G$3:$H$58,MATCH(J50,Arrays!$H$3:$H$58,0),1),UPPER(J50)),\"\")","v":""},{"$f":"IF(K50=\"\",\"\",LEN(SUM(MID(0&K50,LARGE(ISNUMBER(--MID(K50,ROW(INDIRECT(\"1:\"&LEN(K50))),1))* ROW(INDIRECT(\"1:\"&LEN(K50))),ROW(INDIRECT(\"1:\"&LEN(K50))))+1,1)*10^ROW(INDIRECT(\"1:\"&LEN(K50)))/10)))","v":""},"","",{"$f":"IF(AN50<>\"CV\",IF(AM50=\"CV\",LEFT(K50,5)&\"-\"&RIGHT(K50,4),\"\"),IF(LEN(K50)=5,TEXT(K50,\"#\"),IF(AN50=\"CV\",LEFT(K50,5)&\"-\"&RIGHT(K50,4),IF(AND(LEN(K50)=3,(COUNTIFS(Arrays!$I$3:$I$7,'Data Entry Worksheet'!#REF!,Arrays!$K$3:$K$7,LEFT(K50,1))+COUNTIFS(Arrays!$J$3:$J$7,'Data Entry Worksheet'!#REF!,Arrays!$K$3:$K$7,LEFT(K50,1)))>0),\"00\"&TEXT(K50,\"#\"),IF(AND(LEN(K50)=4,(COUNTIFS(Arrays!$M$3:$M$13,'Data Entry Worksheet'!#REF!,Arrays!$O$3:$O$13,LEFT(K50,1))+COUNTIFS(Arrays!$N$3:$N$13,'Data Entry Worksheet'!#REF!,Arrays!$O$3:$O$13,LEFT(K50,1)))>0),\"0\"&TEXT(K50,\"#\"),\"\")))))","v":""},{"$f":"IF(L50=\"\",\"\",IF(ISNA(MATCH(L50,Arrays!$G$3:$G$58,0)),IF(ISNA(MATCH(L50,Arrays!$H$3:$H$58,0)),\"NC\",\"CV\"),IF(EXACT(UPPER(L50),L50),\"C\",\"CV\")))","v":""},{"$f":"IF(AP50=\"CV\",IF(ISNA(MATCH(L50,Arrays!$G$3:$G$58,0)),INDEX(Arrays!$G$3:$H$58,MATCH(L50,Arrays!$H$3:$H$58,0),1),UPPER(L50)),\"\")","v":""},"","","","","",{"$f":"IF(O50=\"\",\"\",IF(ISNA(MATCH(O50,Arrays!$G$60:$G$65,0)),\"NC\",IF(EXACT(UPPER(O50),O50),\"C\",\"CV\")))","v":""},""]
["","","",null,null,null,null,null,null,null,null,null,null,null,null,"","","",null,"","","",{"$f":"IF(E51<>\"\",LEN(SUM(MID(0&E51,LARGE(ISNUMBER(--MID(E51,ROW(INDIRECT(\"1:\"&LEN(E51))),1))* ROW(INDIRECT(\"1:\"&LEN(E51))),ROW(INDIRECT(\"1:\"&LEN(E51))))+1,1)*10^ROW(INDIRECT(\"1:\"&LEN(E51)))/10)),\"\")","v":""},"","","","","","","","","","","","",{"$f":"IF(J51=\"\",\"\",IF(ISNA(MATCH(J51,Arrays!$G$3:$G$58,0)),IF(ISNA(MATCH(J51,Arrays!$H$3:$H$58,0)),\"NC\",\"CV\"),IF(EXACT(UPPER(J51),J51),\"C\",\"CV\")))","v":""},{"$f":"IF(AJ51=\"CV\",IF(ISNA(MATCH(J51,Arrays!$G$3:$G$58,0)),INDEX(Arrays!$G$3:$H$58,MATCH(J51,Arrays!$H$3:$H$58,0),1),UPPER(J51)),\"\")","v":""},{"$f":"IF(K51=\"\",\"\",LEN(SUM(MID(0&K51,LARGE(ISNUMBER(--MID(K51,ROW(INDIRECT(\"1:\"&LEN(K51))),1))* ROW(INDIRECT(\"1:\"&LEN(K51))),ROW(INDIRECT(\"1:\"&LEN(K51))))+1,1)*10^ROW(INDIRECT(\"1:\"&LEN(K51)))/10)))","v":""},"","",{"$f":"IF(AN51<>\"CV\",IF(AM51=\"CV\",LEFT(K51,5)&\"-\"&RIGHT(K51,4),\"\"),IF(LEN(K51)=5,TEXT(K51,\"#\"),IF(AN51=\"CV\",LEFT(K51,5)&\"-\"&RIGHT(K51,4),IF(AND(LEN(K51)=3,(COUNTIFS(Arrays!$I$3:$I$7,'Data Entry Worksheet'!#REF!,Arrays!$K$3:$K$7,LEFT(K51,1))+COUNTIFS(Arrays!$J$3:$J$7,'Data Entry Worksheet'!#REF!,Arrays!$K$3:$K$7,LEFT(K51,1)))>0),\"00\"&TEXT(K51,\"#\"),IF(AND(LEN(K51)=4,(COUNTIFS(Arrays!$M$3:$M$13,'Data Entry Worksheet'!#REF!,Arrays!$O$3:$O$13,LEFT(K51,1))+COUNTIFS(Arrays!$N$3:$N$13,'Data Entry Worksheet'!#REF!,Arrays!$O$3:$O$13,LEFT(K51,1)))>0),\"0\"&TEXT(K51,\"#\"),\"\")))))","v":""},{"$f":"IF(L51=\"\",\"\",IF(ISNA(MATCH(L51,Arrays!$G$3:$G$58,0)),IF(ISNA(MATCH(L51,Arrays!$H$3:$H$58,0)),\"NC\",\"CV\"),IF(EXACT(UPPER(L51),L51),\"C\",\"CV\")))","v":""},{"$f":"IF(AP51=\"CV\",IF(ISNA(MATCH(L51,Arrays!$G$3:$G$58,0)),INDEX(Arrays!$G$3:$H$58,MATCH(L51,Arrays!$H$3:$H$58,0),1),UPPER(L51)),\"\")","v":""},"","","","","",{"$f":"IF(O51=\"\",\"\",IF(ISNA(MATCH(O51,Arrays!$G$60:$G$65,0)),\"NC\",IF(EXACT(UPPER(O51),O51),\"C\",\"CV\")))","v":""},""]
["","","",null,null,null,null,null,null,null,null,null,null,null,null,"","","",null,"","","",{"$f":"IF(E52<>\"\",LEN(SUM(MID(0&E52,LARGE(ISNUMBER(--MID(E52,ROW(INDIRECT(\"1:\"&LEN(E52))),1))* ROW(INDIRECT(\"1:\"&LEN(E52))),ROW(INDIRECT(\"1:\"&LEN(E52))))+1,1)*10^ROW(INDIRECT(\"1:\"&LEN(E52)))/10)),\"\")","v":""},"","","","","","","","","","","","",{"$f":"IF(J52=\"\",\"\",IF(ISNA(MATCH(J52,Arrays!$G$3:$G$58,0)),IF(ISNA(MATCH(J52,Arrays!$H$3:$H$58,0)),\"NC\",\"CV\"),IF(EXACT(UPPER(J52),J52),\"C\",\"CV\")))","v":""},{"$f":"IF(AJ52=\"CV\",IF(ISNA(MATCH(J52,Arrays!$G$3:$G$58,0)),INDEX(Arrays!$G$3:$H$58,MATCH(J52,Arrays!$H$3:$H$58,0),1),UPPER(J52)),\"\")","v":""},{"$f":"IF(K52=\"\",\"\",LEN(SUM(MID(0&K52,LARGE(ISNUMBER(--MID(K52,ROW(INDIRECT(\"1:\"&LEN(K52))),1))* ROW(INDIRECT(\"1:\"&LEN(K52))),ROW(INDIRECT(\"1:\"&LEN(K52))))+1,1)*10^ROW(INDIRECT(\"1:\"&LEN(K52)))/10)))","v":""},"","",{"$f":"IF(AN52<>\"CV\",IF(AM52=\"CV\",LEFT(K52,5)&\"-\"&RIGHT(K52,4),\"\"),IF(LEN(K52)=5,TEXT(K52,\"#\"),IF(AN52=\"CV\",LEFT(K52,5)&\"-\"&RIGHT(K52,4),IF(AND(LEN(K52)=3,(COUNTIFS(Arrays!$I$3:$I$7,'Data Entry Worksheet'!#REF!,Arrays!$K$3:$K$7,LEFT(K52,1))+COUNTIFS(Arrays!$J$3:$J$7,'Data Entry Worksheet'!#REF!,Arrays!$K$3:$K$7,LEFT(K52,1)))>0),\"00\"&TEXT(K52,\"#\"),IF(AND(LEN(K52)=4,(COUNTIFS(Arrays!$M$3:$M$13,'Data Entry Worksheet'!#REF!,Arrays!$O$3:$O$13,LEFT(K52,1))+COUNTIFS(Arrays!$N$3:$N$13,'Data Entry Worksheet'!#REF!,Arrays!$O$3:$O$13,LEFT(K52,1)))>0),\"0\"&TEXT(K52,\"#\"),\"\")))))","v":""},{"$f":"IF(L52=\"\",\"\",IF(ISNA(MATCH(L52,Arrays!$G$3:$G$58,0)),IF(ISNA(MATCH(L52,Arrays!$H$3:$H$58,0)),\"NC\",\"CV\"),IF(EXACT(UPPER(L52),L52),\"C\",\"CV\")))","v":""},{"$f":"IF(AP52=\"CV\",IF(ISNA(MATCH(L52,Arrays!$G$3:$G$58,0)),INDEX(Arrays!$G$3:$H$58,MATCH(L52,Arrays!$H$3:$H$58,0),1),UPPER(L52)),\"\")","v":""},"","","","","",{"$f":"IF(O52=\"\",\"\",IF(ISNA(MATCH(O52,Arrays!$G$60:$G$65,0)),\"NC\",IF(EXACT(UPPER(O52),O52),\"C\",\"CV\")))","v":""},""]
["","","",null,null,null,null,null,null,null,null,null,null,null,null,"","","",null,"","","",{"$f":"IF(E53<>\"\",LEN(SUM(MID(0&E53,LARGE(ISNUMBER(--MID(E53,ROW(INDIRECT(\"1:\"&LEN(E53))),1))* ROW(INDIRECT(\"1:\"&LEN(E53))),ROW(INDIRECT(\"1:\"&LEN(E53))))+1,1)*10^ROW(INDIRECT(\"1:\"&LEN(E53)))/10)),\"\")","v":""},"","","","","","","","","","","","",{"$f":"IF(J53=\"\",\"\",IF(ISNA(MATCH(J53,Arrays!$G$3:$G$58,0)),IF(ISNA(MATCH(J53,Arrays!$H$3:$H$58,0)),\"NC\",\"CV\"),IF(EXACT(UPPER(J53),J53),\"C\",\"CV\")))","v":""},{"$f":"IF(AJ53=\"CV\",IF(ISNA(MATCH(J53,Arrays!$G$3:$G$58,0)),INDEX(Arrays!$G$3:$H$58,MATCH(J53,Arrays!$H$3:$H$58,0),1),UPPER(J53)),\"\")","v":""},{"$f":"IF(K53=\"\",\"\",LEN(SUM(MID(0&K53,LARGE(ISNUMBER(--MID(K53,ROW(INDIRECT(\"1:\"&LEN(K53))),1))* ROW(INDIRECT(\"1:\"&LEN(K53))),ROW(INDIRECT(\"1:\"&LEN(K53))))+1,1)*10^ROW(INDIRECT(\"1:\"&LEN(K53)))/10)))","v":""},"","",{"$f":"IF(AN53<>\"CV\",IF(AM53=\"CV\",LEFT(K53,5)&\"-\"&RIGHT(K53,4),\"\"),IF(LEN(K53)=5,TEXT(K53,\"#\"),IF(AN53=\"CV\",LEFT(K53,5)&\"-\"&RIGHT(K53,4),IF(AND(LEN(K53)=3,(COUNTIFS(Arrays!$I$3:$I$7,'Data Entry Worksheet'!#REF!,Arrays!$K$3:$K$7,LEFT(K53,1))+COUNTIFS(Arrays!$J$3:$J$7,'Data Entry Worksheet'!#REF!,Arrays!$K$3:$K$7,LEFT(K53,1)))>0),\"00\"&TEXT(K53,\"#\"),IF(AND(LEN(K53)=4,(COUNTIFS(Arrays!$M$3:$M$13,'Data Entry Worksheet'!#REF!,Arrays!$O$3:$O$13,LEFT(K53,1))+COUNTIFS(Arrays!$N$3:$N$13,'Data Entry Worksheet'!#REF!,Arrays!$O$3:$O$13,LEFT(K53,1)))>0),\"0\"&TEXT(K53,\"#\"),\"\")))))","v":""},{"$f":"IF(L53=\"\",\"\",IF(ISNA(MATCH(L53,Arrays!$G$3:$G$58,0)),IF(ISNA(MATCH(L53,Arrays!$H$3:$H$58,0)),\"NC\",\"CV\"),IF(EXACT(UPPER(L53),L53),\"C\",\"CV\")))","v":""},{"$f":"IF(AP53=\"CV\",IF(ISNA(MATCH(L53,Arrays!$G$3:$G$58,0)),INDEX(Arrays!$G$3:$H$58,MATCH(L53,Arrays!$H$3:$H$58,0),1),UPPER(L53)),\"\")","v":""},"","","","","",{"$f":"IF(O53=\"\",\"\",IF(ISNA(MATCH(O53,Arrays!$G$60:$G$65,0)),\"NC\",IF(EXACT(UPPER(O53),O53),\"C\",\"CV\")))","v":""},""]
["","","",null,null,null,null,null,null,null,null,null,null,null,null,"","","",null,"","","",{"$f":"IF(E54<>\"\",LEN(SUM(MID(0&E54,LARGE(ISNUMBER(--MID(E54,ROW(INDIRECT(\"1:\"&LEN(E54))),1))* ROW(INDIRECT(\"1:\"&LEN(E54))),ROW(INDIRECT(\"1:\"&LEN(E54))))+1,1)*10^ROW(INDIRECT(\"1:\"&LEN(E54)))/10)),\"\")","v":""},"","","","","","","","","","","","",{"$f":"IF(J54=\"\",\"\",IF(ISNA(MATCH(J54,Arrays!$G$3:$G$58,0)),IF(ISNA(MATCH(J54,Arrays!$H$3:$H$58,0)),\"NC\",\"CV\"),IF(EXACT(UPPER(J54),J54),\"C\",\"CV\")))","v":""},{"$f":"IF(AJ54=\"CV\",IF(ISNA(MATCH(J54,Arrays!$G$3:$G$58,0)),INDEX(Arrays!$G$3:$H$58,MATCH(J54,Arrays!$H$3:$H$58,0),1),UPPER(J54)),\"\")","v":""},{"$f":"IF(K54=\"\",\"\",LEN(SUM(MID(0&K54,LARGE(ISNUMBER(--MID(K54,ROW(INDIRECT(\"1:\"&LEN(K54))),1))* ROW(INDIRECT(\"1:\"&LEN(K54))),ROW(INDIRECT(\"1:\"&LEN(K54))))+1,1)*10^ROW(INDIRECT(\"1:\"&LEN(K54)))/10)))","v":""},"","",{"$f":"IF(AN54<>\"CV\",IF(AM54=\"CV\",LEFT(K54,5)&\"-\"&RIGHT(K54,4),\"\"),IF(LEN(K54)=5,TEXT(K54,\"#\"),IF(AN54=\"CV\",LEFT(K54,5)&\"-\"&RIGHT(K54,4),IF(AND(LEN(K54)=3,(COUNTIFS(Arrays!$I$3:$I$7,'Data Entry Worksheet'!#REF!,Arrays!$K$3:$K$7,LEFT(K54,1))+COUNTIFS(Arrays!$J$3:$J$7,'Data Entry Worksheet'!#REF!,Arrays!$K$3:$K$7,LEFT(K54,1)))>0),\"00\"&TEXT(K54,\"#\"),IF(AND(LEN(K54)=4,(COUNTIFS(Arrays!$M$3:$M$13,'Data Entry Worksheet'!#REF!,Arrays!$O$3:$O$13,LEFT(K54,1))+COUNTIFS(Arrays!$N$3:$N$13,'Data Entry Worksheet'!#REF!,Arrays!$O$3:$O$13,LEFT(K54,1)))>0),\"0\"&TEXT(K54,\"#\"),\"\")))))","v":""},{"$f":"IF(L54=\"\",\"\",IF(ISNA(MATCH(L54,Arrays!$G$3:$G$58,0)),IF(ISNA(MATCH(L54,Arrays!$H$3:$H$58,0)),\"NC\",\"CV\"),IF(EXACT(UPPER(L54),L54),\"C\",\"CV\")))","v":""},{"$f":"IF(AP54=\"CV\",IF(ISNA(MATCH(L54,Arrays!$G$3:$G$58,0)),INDEX(Arrays!$G$3:$H$58,MATCH(L54,Arrays!$H$3:$H$58,0),1),UPPER(L54)),\"\")","v":""},"","","","","",{"$f":"IF(O54=\"\",\"\",IF(ISNA(MATCH(O54,Arrays!$G$60:$G$65,0)),\"NC\",IF(EXACT(UPPER(O54),O54),\"C\",\"CV\")))","v":""},""]
["","","",null,null,null,null,null,null,null,null,null,null,null,null,"","","",null,"","","",{"$f":"IF(E55<>\"\",LEN(SUM(MID(0&E55,LARGE(ISNUMBER(--MID(E55,ROW(INDIRECT(\"1:\"&LEN(E55))),1))* ROW(INDIRECT(\"1:\"&LEN(E55))),ROW(INDIRECT(\"1:\"&LEN(E55))))+1,1)*10^ROW(INDIRECT(\"1:\"&LEN(E55)))/10)),\"\")","v":""},"","","","","","","","","","","","",{"$f":"IF(J55=\"\",\"\",IF(ISNA(MATCH(J55,Arrays!$G$3:$G$58,0)),IF(ISNA(MATCH(J55,Arrays!$H$3:$H$58,0)),\"NC\",\"CV\"),IF(EXACT(UPPER(J55),J55),\"C\",\"CV\")))","v":""},{"$f":"IF(AJ55=\"CV\",IF(ISNA(MATCH(J55,Arrays!$G$3:$G$58,0)),INDEX(Arrays!$G$3:$H$58,MATCH(J55,Arrays!$H$3:$H$58,0),1),UPPER(J55)),\"\")","v":""},{"$f":"IF(K55=\"\",\"\",LEN(SUM(MID(0&K55,LARGE(ISNUMBER(--MID(K55,ROW(INDIRECT(\"1:\"&LEN(K55))),1))* ROW(INDIRECT(\"1:\"&LEN(K55))),ROW(INDIRECT(\"1:\"&LEN(K55))))+1,1)*10^ROW(INDIRECT(\"1:\"&LEN(K55)))/10)))","v":""},"","",{"$f":"IF(AN55<>\"CV\",IF(AM55=\"CV\",LEFT(K55,5)&\"-\"&RIGHT(K55,4),\"\"),IF(LEN(K55)=5,TEXT(K55,\"#\"),IF(AN55=\"CV\",LEFT(K55,5)&\"-\"&RIGHT(K55,4),IF(AND(LEN(K55)=3,(COUNTIFS(Arrays!$I$3:$I$7,'Data Entry Worksheet'!#REF!,Arrays!$K$3:$K$7,LEFT(K55,1))+COUNTIFS(Arrays!$J$3:$J$7,'Data Entry Worksheet'!#REF!,Arrays!$K$3:$K$7,LEFT(K55,1)))>0),\"00\"&TEXT(K55,\"#\"),IF(AND(LEN(K55)=4,(COUNTIFS(Arrays!$M$3:$M$13,'Data Entry Worksheet'!#REF!,Arrays!$O$3:$O$13,LEFT(K55,1))+COUNTIFS(Arrays!$N$3:$N$13,'Data Entry Worksheet'!#REF!,Arrays!$O$3:$O$13,LEFT(K55,1)))>0),\"0\"&TEXT(K55,\"#\"),\"\")))))","v":""},{"$f":"IF(L55=\"\",\"\",IF(ISNA(MATCH(L55,Arrays!$G$3:$G$58,0)),IF(ISNA(MATCH(L55,Arrays!$H$3:$H$58,0)),\"NC\",\"CV\"),IF(EXACT(UPPER(L55),L55),\"C\",\"CV\")))","v":""},{"$f":"IF(AP55=\"CV\",IF(ISNA(MATCH(L55,Arrays!$G$3:$G$58,0)),INDEX(Arrays!$G$3:$H$58,MATCH(L55,Arrays!$H$3:$H$58,0),1),UPPER(L55)),\"\")","v":""},"","","","","",{"$f":"IF(O55=\"\",\"\",IF(ISNA(MATCH(O55,Arrays!$G$60:$G$65,0)),\"NC\",IF(EXACT(UPPER(O55),O55),\"C\",\"CV\")))","v":""},""]
["","","",null,null,null,null,null,null,null,null,null,null,null,null,"","","",null,"","","",{"$f":"IF(E56<>\"\",LEN(SUM(MID(0&E56,LARGE(ISNUMBER(--MID(E56,ROW(INDIRECT(\"1:\"&LEN(E56))),1))* ROW(INDIRECT(\"1:\"&LEN(E56))),ROW(INDIRECT(\"1:\"&LEN(E56))))+1,1)*10^ROW(INDIRECT(\"1:\"&LEN(E56)))/10)),\"\")","v":""},"","","","","","","","","","","","",{"$f":"IF(J56=\"\",\"\",IF(ISNA(MATCH(J56,Arrays!$G$3:$G$58,0)),IF(ISNA(MATCH(J56,Arrays!$H$3:$H$58,0)),\"NC\",\"CV\"),IF(EXACT(UPPER(J56),J56),\"C\",\"CV\")))","v":""},{"$f":"IF(AJ56=\"CV\",IF(ISNA(MATCH(J56,Arrays!$G$3:$G$58,0)),INDEX(Arrays!$G$3:$H$58,MATCH(J56,Arrays!$H$3:$H$58,0),1),UPPER(J56)),\"\")","v":""},{"$f":"IF(K56=\"\",\"\",LEN(SUM(MID(0&K56,LARGE(ISNUMBER(--MID(K56,ROW(INDIRECT(\"1:\"&LEN(K56))),1))* ROW(INDIRECT(\"1:\"&LEN(K56))),ROW(INDIRECT(\"1:\"&LEN(K56))))+1,1)*10^ROW(INDIRECT(\"1:\"&LEN(K56)))/10)))","v":""},"","",{"$f":"IF(AN56<>\"CV\",IF(AM56=\"CV\",LEFT(K56,5)&\"-\"&RIGHT(K56,4),\"\"),IF(LEN(K56)=5,TEXT(K56,\"#\"),IF(AN56=\"CV\",LEFT(K56,5)&\"-\"&RIGHT(K56,4),IF(AND(LEN(K56)=3,(COUNTIFS(Arrays!$I$3:$I$7,'Data Entry Worksheet'!#REF!,Arrays!$K$3:$K$7,LEFT(K56,1))+COUNTIFS(Arrays!$J$3:$J$7,'Data Entry Worksheet'!#REF!,Arrays!$K$3:$K$7,LEFT(K56,1)))>0),\"00\"&TEXT(K56,\"#\"),IF(AND(LEN(K56)=4,(COUNTIFS(Arrays!$M$3:$M$13,'Data Entry Worksheet'!#REF!,Arrays!$O$3:$O$13,LEFT(K56,1))+COUNTIFS(Arrays!$N$3:$N$13,'Data Entry Worksheet'!#REF!,Arrays!$O$3:$O$13,LEFT(K56,1)))>0),\"0\"&TEXT(K56,\"#\"),\"\")))))","v":""},{"$f":"IF(L56=\"\",\"\",IF(ISNA(MATCH(L56,Arrays!$G$3:$G$58,0)),IF(ISNA(MATCH(L56,Arrays!$H$3:$H$58,0)),\"NC\",\"CV\"),IF(EXACT(UPPER(L56),L56),\"C\",\"CV\")))","v":""},{"$f":"IF(AP56=\"CV\",IF(ISNA(MATCH(L56,Arrays!$G$3:$G$58,0)),INDEX(Arrays!$G$3:$H$58,MATCH(L56,Arrays!$H$3:$H$58,0),1),UPPER(L56)),\"\")","v":""},"","","","","",{"$f":"IF(O56=\"\",\"\",IF(ISNA(MATCH(O56,Arrays!$G$60:$G$65,0)),\"NC\",IF(EXACT(UPPER(O56),O56),\"C\",\"CV\")))","v":""},""]
["","","",null,null,null,null,null,null,null,null,null,null,null,null,"","","",null,"","","",{"$f":"IF(E57<>\"\",LEN(SUM(MID(0&E57,LARGE(ISNUMBER(--MID(E57,ROW(INDIRECT(\"1:\"&LEN(E57))),1))* ROW(INDIRECT(\"1:\"&LEN(E57))),ROW(INDIRECT(\"1:\"&LEN(E57))))+1,1)*10^ROW(INDIRECT(\"1:\"&LEN(E57)))/10)),\"\")","v":""},"","","","","","","","","","","","",{"$f":"IF(J57=\"\",\"\",IF(ISNA(MATCH(J57,Arrays!$G$3:$G$58,0)),IF(ISNA(MATCH(J57,Arrays!$H$3:$H$58,0)),\"NC\",\"CV\"),IF(EXACT(UPPER(J57),J57),\"C\",\"CV\")))","v":""},{"$f":"IF(AJ57=\"CV\",IF(ISNA(MATCH(J57,Arrays!$G$3:$G$58,0)),INDEX(Arrays!$G$3:$H$58,MATCH(J57,Arrays!$H$3:$H$58,0),1),UPPER(J57)),\"\")","v":""},{"$f":"IF(K57=\"\",\"\",LEN(SUM(MID(0&K57,LARGE(ISNUMBER(--MID(K57,ROW(INDIRECT(\"1:\"&LEN(K57))),1))* ROW(INDIRECT(\"1:\"&LEN(K57))),ROW(INDIRECT(\"1:\"&LEN(K57))))+1,1)*10^ROW(INDIRECT(\"1:\"&LEN(K57)))/10)))","v":""},"","",{"$f":"IF(AN57<>\"CV\",IF(AM57=\"CV\",LEFT(K57,5)&\"-\"&RIGHT(K57,4),\"\"),IF(LEN(K57)=5,TEXT(K57,\"#\"),IF(AN57=\"CV\",LEFT(K57,5)&\"-\"&RIGHT(K57,4),IF(AND(LEN(K57)=3,(COUNTIFS(Arrays!$I$3:$I$7,'Data Entry Worksheet'!#REF!,Arrays!$K$3:$K$7,LEFT(K57,1))+COUNTIFS(Arrays!$J$3:$J$7,'Data Entry Worksheet'!#REF!,Arrays!$K$3:$K$7,LEFT(K57,1)))>0),\"00\"&TEXT(K57,\"#\"),IF(AND(LEN(K57)=4,(COUNTIFS(Arrays!$M$3:$M$13,'Data Entry Worksheet'!#REF!,Arrays!$O$3:$O$13,LEFT(K57,1))+COUNTIFS(Arrays!$N$3:$N$13,'Data Entry Worksheet'!#REF!,Arrays!$O$3:$O$13,LEFT(K57,1)))>0),\"0\"&TEXT(K57,\"#\"),\"\")))))","v":""},{"$f":"IF(L57=\"\",\"\",IF(ISNA(MATCH(L57,Arrays!$G$3:$G$58,0)),IF(ISNA(MATCH(L57,Arrays!$H$3:$H$58,0)),\"NC\",\"CV\"),IF(EXACT(UPPER(L57),L57),\"C\",\"CV\")))","v":""},{"$f":"IF(AP57=\"CV\",IF(ISNA(MATCH(L57,Arrays!$G$3:$G$58,0)),INDEX(Arrays!$G$3:$H$58,MATCH(L57,Arrays!$H$3:$H$58,0),1),UPPER(L57)),\"\")","v":""},"","","","","",{"$f":"IF(O57=\"\",\"\",IF(ISNA(MATCH(O57,Arrays!$G$60:$G$65,0)),\"NC\",IF(EXACT(UPPER(O57),O57),\"C\",\"CV\")))","v":""},""]
["","","",null,null,null,null,null,null,null,null,null,null,null,null,"","","",null,"","","",{"$f":"IF(E58<>\"\",LEN(SUM(MID(0&E58,LARGE(ISNUMBER(--MID(E58,ROW(INDIRECT(\"1:\"&LEN(E58))),1))* ROW(INDIRECT(\"1:\"&LEN(E58))),ROW(INDIRECT(\"1:\"&LEN(E58))))+1,1)*10^ROW(INDIRECT(\"1:\"&LEN(E58)))/10)),\"\")","v":""},"","","","","","","","","","","","",{"$f":"IF(J58=\"\",\"\",IF(ISNA(MATCH(J58,Arrays!$G$3:$G$58,0)),IF(ISNA(MATCH(J58,Arrays!$H$3:$H$58,0)),\"NC\",\"CV\"),IF(EXACT(UPPER(J58),J58),\"C\",\"CV\")))","v":""},{"$f":"IF(AJ58=\"CV\",IF(ISNA(MATCH(J58,Arrays!$G$3:$G$58,0)),INDEX(Arrays!$G$3:$H$58,MATCH(J58,Arrays!$H$3:$H$58,0),1),UPPER(J58)),\"\")","v":""},{"$f":"IF(K58=\"\",\"\",LEN(SUM(MID(0&K58,LARGE(ISNUMBER(--MID(K58,ROW(INDIRECT(\"1:\"&LEN(K58))),1))* ROW(INDIRECT(\"1:\"&LEN(K58))),ROW(INDIRECT(\"1:\"&LEN(K58))))+1,1)*10^ROW(INDIRECT(\"1:\"&LEN(K58)))/10)))","v":""},"","",{"$f":"IF(AN58<>\"CV\",IF(AM58=\"CV\",LEFT(K58,5)&\"-\"&RIGHT(K58,4),\"\"),IF(LEN(K58)=5,TEXT(K58,\"#\"),IF(AN58=\"CV\",LEFT(K58,5)&\"-\"&RIGHT(K58,4),IF(AND(LEN(K58)=3,(COUNTIFS(Arrays!$I$3:$I$7,'Data Entry Worksheet'!#REF!,Arrays!$K$3:$K$7,LEFT(K58,1))+COUNTIFS(Arrays!$J$3:$J$7,'Data Entry Worksheet'!#REF!,Arrays!$K$3:$K$7,LEFT(K58,1)))>0),\"00\"&TEXT(K58,\"#\"),IF(AND(LEN(K58)=4,(COUNTIFS(Arrays!$M$3:$M$13,'Data Entry Worksheet'!#REF!,Arrays!$O$3:$O$13,LEFT(K58,1))+COUNTIFS(Arrays!$N$3:$N$13,'Data Entry Worksheet'!#REF!,Arrays!$O$3:$O$13,LEFT(K58,1)))>0),\"0\"&TEXT(K58,\"#\"),\"\")))))","v":""},{"$f":"IF(L58=\"\",\"\",IF(ISNA(MATCH(L58,Arrays!$G$3:$G$58,0)),IF(ISNA(MATCH(L58,Arrays!$H$3:$H$58,0)),\"NC\",\"CV\"),IF(EXACT(UPPER(L58),L58),\"C\",\"CV\")))","v":""},{"$f":"IF(AP58=\"CV\",IF(ISNA(MATCH(L58,Arrays!$G$3:$G$58,0)),INDEX(Arrays!$G$3:$H$58,MATCH(L58,Arrays!$H$3:$H$58,0),1),UPPER(L58)),\"\")","v":""},"","","","","",{"$f":"IF(O58=\"\",\"\",IF(ISNA(MATCH(O58,Arrays!$G$60:$G$65,0)),\"NC\",IF(EXACT(UPPER(O58),O58),\"C\",\"CV\")))","v":""},""]
["","","",null,null,null,null,null,null,null,null,null,null,null,null,"","","",null,"","","",{"$f":"IF(E59<>\"\",LEN(SUM(MID(0&E59,LARGE(ISNUMBER(--MID(E59,ROW(INDIRECT(\"1:\"&LEN(E59))),1))* ROW(INDIRECT(\"1:\"&LEN(E59))),ROW(INDIRECT(\"1:\"&LEN(E59))))+1,1)*10^ROW(INDIRECT(\"1:\"&LEN(E59)))/10)),\"\")","v":""},"","","","","","","","","","","","",{"$f":"IF(J59=\"\",\"\",IF(ISNA(MATCH(J59,Arrays!$G$3:$G$58,0)),IF(ISNA(MATCH(J59,Arrays!$H$3:$H$58,0)),\"NC\",\"CV\"),IF(EXACT(UPPER(J59),J59),\"C\",\"CV\")))","v":""},{"$f":"IF(AJ59=\"CV\",IF(ISNA(MATCH(J59,Arrays!$G$3:$G$58,0)),INDEX(Arrays!$G$3:$H$58,MATCH(J59,Arrays!$H$3:$H$58,0),1),UPPER(J59)),\"\")","v":""},{"$f":"IF(K59=\"\",\"\",LEN(SUM(MID(0&K59,LARGE(ISNUMBER(--MID(K59,ROW(INDIRECT(\"1:\"&LEN(K59))),1))* ROW(INDIRECT(\"1:\"&LEN(K59))),ROW(INDIRECT(\"1:\"&LEN(K59))))+1,1)*10^ROW(INDIRECT(\"1:\"&LEN(K59)))/10)))","v":""},"","",{"$f":"IF(AN59<>\"CV\",IF(AM59=\"CV\",LEFT(K59,5)&\"-\"&RIGHT(K59,4),\"\"),IF(LEN(K59)=5,TEXT(K59,\"#\"),IF(AN59=\"CV\",LEFT(K59,5)&\"-\"&RIGHT(K59,4),IF(AND(LEN(K59)=3,(COUNTIFS(Arrays!$I$3:$I$7,'Data Entry Worksheet'!#REF!,Arrays!$K$3:$K$7,LEFT(K59,1))+COUNTIFS(Arrays!$J$3:$J$7,'Data Entry Worksheet'!#REF!,Arrays!$K$3:$K$7,LEFT(K59,1)))>0),\"00\"&TEXT(K59,\"#\"),IF(AND(LEN(K59)=4,(COUNTIFS(Arrays!$M$3:$M$13,'Data Entry Worksheet'!#REF!,Arrays!$O$3:$O$13,LEFT(K59,1))+COUNTIFS(Arrays!$N$3:$N$13,'Data Entry Worksheet'!#REF!,Arrays!$O$3:$O$13,LEFT(K59,1)))>0),\"0\"&TEXT(K59,\"#\"),\"\")))))","v":""},{"$f":"IF(L59=\"\",\"\",IF(ISNA(MATCH(L59,Arrays!$G$3:$G$58,0)),IF(ISNA(MATCH(L59,Arrays!$H$3:$H$58,0)),\"NC\",\"CV\"),IF(EXACT(UPPER(L59),L59),\"C\",\"CV\")))","v":""},{"$f":"IF(AP59=\"CV\",IF(ISNA(MATCH(L59,Arrays!$G$3:$G$58,0)),INDEX(Arrays!$G$3:$H$58,MATCH(L59,Arrays!$H$3:$H$58,0),1),UPPER(L59)),\"\")","v":""},"","","","","",{"$f":"IF(O59=\"\",\"\",IF(ISNA(MATCH(O59,Arrays!$G$60:$G$65,0)),\"NC\",IF(EXACT(UPPER(O59),O59),\"C\",\"CV\")))","v":""},""]
["","","",null,null,null,null,null,null,null,null,null,null,null,null,"","","",null,"","","",{"$f":"IF(E60<>\"\",LEN(SUM(MID(0&E60,LARGE(ISNUMBER(--MID(E60,ROW(INDIRECT(\"1:\"&LEN(E60))),1))* ROW(INDIRECT(\"1:\"&LEN(E60))),ROW(INDIRECT(\"1:\"&LEN(E60))))+1,1)*10^ROW(INDIRECT(\"1:\"&LEN(E60)))/10)),\"\")","v":""},"","","","","","","","","","","","",{"$f":"IF(J60=\"\",\"\",IF(ISNA(MATCH(J60,Arrays!$G$3:$G$58,0)),IF(ISNA(MATCH(J60,Arrays!$H$3:$H$58,0)),\"NC\",\"CV\"),IF(EXACT(UPPER(J60),J60),\"C\",\"CV\")))","v":""},{"$f":"IF(AJ60=\"CV\",IF(ISNA(MATCH(J60,Arrays!$G$3:$G$58,0)),INDEX(Arrays!$G$3:$H$58,MATCH(J60,Arrays!$H$3:$H$58,0),1),UPPER(J60)),\"\")","v":""},{"$f":"IF(K60=\"\",\"\",LEN(SUM(MID(0&K60,LARGE(ISNUMBER(--MID(K60,ROW(INDIRECT(\"1:\"&LEN(K60))),1))* ROW(INDIRECT(\"1:\"&LEN(K60))),ROW(INDIRECT(\"1:\"&LEN(K60))))+1,1)*10^ROW(INDIRECT(\"1:\"&LEN(K60)))/10)))","v":""},"","",{"$f":"IF(AN60<>\"CV\",IF(AM60=\"CV\",LEFT(K60,5)&\"-\"&RIGHT(K60,4),\"\"),IF(LEN(K60)=5,TEXT(K60,\"#\"),IF(AN60=\"CV\",LEFT(K60,5)&\"-\"&RIGHT(K60,4),IF(AND(LEN(K60)=3,(COUNTIFS(Arrays!$I$3:$I$7,'Data Entry Worksheet'!#REF!,Arrays!$K$3:$K$7,LEFT(K60,1))+COUNTIFS(Arrays!$J$3:$J$7,'Data Entry Worksheet'!#REF!,Arrays!$K$3:$K$7,LEFT(K60,1)))>0),\"00\"&TEXT(K60,\"#\"),IF(AND(LEN(K60)=4,(COUNTIFS(Arrays!$M$3:$M$13,'Data Entry Worksheet'!#REF!,Arrays!$O$3:$O$13,LEFT(K60,1))+COUNTIFS(Arrays!$N$3:$N$13,'Data Entry Worksheet'!#REF!,Arrays!$O$3:$O$13,LEFT(K60,1)))>0),\"0\"&TEXT(K60,\"#\"),\"\")))))","v":""},{"$f":"IF(L60=\"\",\"\",IF(ISNA(MATCH(L60,Arrays!$G$3:$G$58,0)),IF(ISNA(MATCH(L60,Arrays!$H$3:$H$58,0)),\"NC\",\"CV\"),IF(EXACT(UPPER(L60),L60),\"C\",\"CV\")))","v":""},{"$f":"IF(AP60=\"CV\",IF(ISNA(MATCH(L60,Arrays!$G$3:$G$58,0)),INDEX(Arrays!$G$3:$H$58,MATCH(L60,Arrays!$H$3:$H$58,0),1),UPPER(L60)),\"\")","v":""},"","","","","",{"$f":"IF(O60=\"\",\"\",IF(ISNA(MATCH(O60,Arrays!$G$60:$G$65,0)),\"NC\",IF(EXACT(UPPER(O60),O60),\"C\",\"CV\")))","v":""},""]
["","","",null,null,null,null,null,null,null,null,null,null,null,null,"","","",null,"","","",{"$f":"IF(E61<>\"\",LEN(SUM(MID(0&E61,LARGE(ISNUMBER(--MID(E61,ROW(INDIRECT(\"1:\"&LEN(E61))),1))* ROW(INDIRECT(\"1:\"&LEN(E61))),ROW(INDIRECT(\"1:\"&LEN(E61))))+1,1)*10^ROW(INDIRECT(\"1:\"&LEN(E61)))/10)),\"\")","v":""},"","","","","","","","","","","","",{"$f":"IF(J61=\"\",\"\",IF(ISNA(MATCH(J61,Arrays!$G$3:$G$58,0)),IF(ISNA(MATCH(J61,Arrays!$H$3:$H$58,0)),\"NC\",\"CV\"),IF(EXACT(UPPER(J61),J61),\"C\",\"CV\")))","v":""},{"$f":"IF(AJ61=\"CV\",IF(ISNA(MATCH(J61,Arrays!$G$3:$G$58,0)),INDEX(Arrays!$G$3:$H$58,MATCH(J61,Arrays!$H$3:$H$58,0),1),UPPER(J61)),\"\")","v":""},{"$f":"IF(K61=\"\",\"\",LEN(SUM(MID(0&K61,LARGE(ISNUMBER(--MID(K61,ROW(INDIRECT(\"1:\"&LEN(K61))),1))* ROW(INDIRECT(\"1:\"&LEN(K61))),ROW(INDIRECT(\"1:\"&LEN(K61))))+1,1)*10^ROW(INDIRECT(\"1:\"&LEN(K61)))/10)))","v":""},"","",{"$f":"IF(AN61<>\"CV\",IF(AM61=\"CV\",LEFT(K61,5)&\"-\"&RIGHT(K61,4),\"\"),IF(LEN(K61)=5,TEXT(K61,\"#\"),IF(AN61=\"CV\",LEFT(K61,5)&\"-\"&RIGHT(K61,4),IF(AND(LEN(K61)=3,(COUNTIFS(Arrays!$I$3:$I$7,'Data Entry Worksheet'!#REF!,Arrays!$K$3:$K$7,LEFT(K61,1))+COUNTIFS(Arrays!$J$3:$J$7,'Data Entry Worksheet'!#REF!,Arrays!$K$3:$K$7,LEFT(K61,1)))>0),\"00\"&TEXT(K61,\"#\"),IF(AND(LEN(K61)=4,(COUNTIFS(Arrays!$M$3:$M$13,'Data Entry Worksheet'!#REF!,Arrays!$O$3:$O$13,LEFT(K61,1))+COUNTIFS(Arrays!$N$3:$N$13,'Data Entry Worksheet'!#REF!,Arrays!$O$3:$O$13,LEFT(K61,1)))>0),\"0\"&TEXT(K61,\"#\"),\"\")))))","v":""},{"$f":"IF(L61=\"\",\"\",IF(ISNA(MATCH(L61,Arrays!$G$3:$G$58,0)),IF(ISNA(MATCH(L61,Arrays!$H$3:$H$58,0)),\"NC\",\"CV\"),IF(EXACT(UPPER(L61),L61),\"C\",\"CV\")))","v":""},{"$f":"IF(AP61=\"CV\",IF(ISNA(MATCH(L61,Arrays!$G$3:$G$58,0)),INDEX(Arrays!$G$3:$H$58,MATCH(L61,Arrays!$H$3:$H$58,0),1),UPPER(L61)),\"\")","v":""},"","","","","",{"$f":"IF(O61=\"\",\"\",IF(ISNA(MATCH(O61,Arrays!$G$60:$G$65,0)),\"NC\",IF(EXACT(UPPER(O61),O61),\"C\",\"CV\")))","v":""},""]
["","","",null,null,null,null,null,null,null,null,null,null,null,null,"","","",null,"","","",{"$f":"IF(E62<>\"\",LEN(SUM(MID(0&E62,LARGE(ISNUMBER(--MID(E62,ROW(INDIRECT(\"1:\"&LEN(E62))),1))* ROW(INDIRECT(\"1:\"&LEN(E62))),ROW(INDIRECT(\"1:\"&LEN(E62))))+1,1)*10^ROW(INDIRECT(\"1:\"&LEN(E62)))/10)),\"\")","v":""},"","","","","","","","","","","","",{"$f":"IF(J62=\"\",\"\",IF(ISNA(MATCH(J62,Arrays!$G$3:$G$58,0)),IF(ISNA(MATCH(J62,Arrays!$H$3:$H$58,0)),\"NC\",\"CV\"),IF(EXACT(UPPER(J62),J62),\"C\",\"CV\")))","v":""},{"$f":"IF(AJ62=\"CV\",IF(ISNA(MATCH(J62,Arrays!$G$3:$G$58,0)),INDEX(Arrays!$G$3:$H$58,MATCH(J62,Arrays!$H$3:$H$58,0),1),UPPER(J62)),\"\")","v":""},{"$f":"IF(K62=\"\",\"\",LEN(SUM(MID(0&K62,LARGE(ISNUMBER(--MID(K62,ROW(INDIRECT(\"1:\"&LEN(K62))),1))* ROW(INDIRECT(\"1:\"&LEN(K62))),ROW(INDIRECT(\"1:\"&LEN(K62))))+1,1)*10^ROW(INDIRECT(\"1:\"&LEN(K62)))/10)))","v":""},"","",{"$f":"IF(AN62<>\"CV\",IF(AM62=\"CV\",LEFT(K62,5)&\"-\"&RIGHT(K62,4),\"\"),IF(LEN(K62)=5,TEXT(K62,\"#\"),IF(AN62=\"CV\",LEFT(K62,5)&\"-\"&RIGHT(K62,4),IF(AND(LEN(K62)=3,(COUNTIFS(Arrays!$I$3:$I$7,'Data Entry Worksheet'!#REF!,Arrays!$K$3:$K$7,LEFT(K62,1))+COUNTIFS(Arrays!$J$3:$J$7,'Data Entry Worksheet'!#REF!,Arrays!$K$3:$K$7,LEFT(K62,1)))>0),\"00\"&TEXT(K62,\"#\"),IF(AND(LEN(K62)=4,(COUNTIFS(Arrays!$M$3:$M$13,'Data Entry Worksheet'!#REF!,Arrays!$O$3:$O$13,LEFT(K62,1))+COUNTIFS(Arrays!$N$3:$N$13,'Data Entry Worksheet'!#REF!,Arrays!$O$3:$O$13,LEFT(K62,1)))>0),\"0\"&TEXT(K62,\"#\"),\"\")))))","v":""},{"$f":"IF(L62=\"\",\"\",IF(ISNA(MATCH(L62,Arrays!$G$3:$G$58,0)),IF(ISNA(MATCH(L62,Arrays!$H$3:$H$58,0)),\"NC\",\"CV\"),IF(EXACT(UPPER(L62),L62),\"C\",\"CV\")))","v":""},{"$f":"IF(AP62=\"CV\",IF(ISNA(MATCH(L62,Arrays!$G$3:$G$58,0)),INDEX(Arrays!$G$3:$H$58,MATCH(L62,Arrays!$H$3:$H$58,0),1),UPPER(L62)),\"\")","v":""},"","","","","",{"$f":"IF(O62=\"\",\"\",IF(ISNA(MATCH(O62,Arrays!$G$60:$G$65,0)),\"NC\",IF(EXACT(UPPER(O62),O62),\"C\",\"CV\")))","v":""},""]
["","","",null,null,null,null,null,null,null,null,null,null,null,null,"","","",null,"","","",{"$f":"IF(E63<>\"\",LEN(SUM(MID(0&E63,LARGE(ISNUMBER(--MID(E63,ROW(INDIRECT(\"1:\"&LEN(E63))),1))* ROW(INDIRECT(\"1:\"&LEN(E63))),ROW(INDIRECT(\"1:\"&LEN(E63))))+1,1)*10^ROW(INDIRECT(\"1:\"&LEN(E63)))/10)),\"\")","v":""},"","","","","","","","","","","","",{"$f":"IF(J63=\"\",\"\",IF(ISNA(MATCH(J63,Arrays!$G$3:$G$58,0)),IF(ISNA(MATCH(J63,Arrays!$H$3:$H$58,0)),\"NC\",\"CV\"),IF(EXACT(UPPER(J63),J63),\"C\",\"CV\")))","v":""},{"$f":"IF(AJ63=\"CV\",IF(ISNA(MATCH(J63,Arrays!$G$3:$G$58,0)),INDEX(Arrays!$G$3:$H$58,MATCH(J63,Arrays!$H$3:$H$58,0),1),UPPER(J63)),\"\")","v":""},{"$f":"IF(K63=\"\",\"\",LEN(SUM(MID(0&K63,LARGE(ISNUMBER(--MID(K63,ROW(INDIRECT(\"1:\"&LEN(K63))),1))* ROW(INDIRECT(\"1:\"&LEN(K63))),ROW(INDIRECT(\"1:\"&LEN(K63))))+1,1)*10^ROW(INDIRECT(\"1:\"&LEN(K63)))/10)))","v":""},"","",{"$f":"IF(AN63<>\"CV\",IF(AM63=\"CV\",LEFT(K63,5)&\"-\"&RIGHT(K63,4),\"\"),IF(LEN(K63)=5,TEXT(K63,\"#\"),IF(AN63=\"CV\",LEFT(K63,5)&\"-\"&RIGHT(K63,4),IF(AND(LEN(K63)=3,(COUNTIFS(Arrays!$I$3:$I$7,'Data Entry Worksheet'!#REF!,Arrays!$K$3:$K$7,LEFT(K63,1))+COUNTIFS(Arrays!$J$3:$J$7,'Data Entry Worksheet'!#REF!,Arrays!$K$3:$K$7,LEFT(K63,1)))>0),\"00\"&TEXT(K63,\"#\"),IF(AND(LEN(K63)=4,(COUNTIFS(Arrays!$M$3:$M$13,'Data Entry Worksheet'!#REF!,Arrays!$O$3:$O$13,LEFT(K63,1))+COUNTIFS(Arrays!$N$3:$N$13,'Data Entry Worksheet'!#REF!,Arrays!$O$3:$O$13,LEFT(K63,1)))>0),\"0\"&TEXT(K63,\"#\"),\"\")))))","v":""},{"$f":"IF(L63=\"\",\"\",IF(ISNA(MATCH(L63,Arrays!$G$3:$G$58,0)),IF(ISNA(MATCH(L63,Arrays!$H$3:$H$58,0)),\"NC\",\"CV\"),IF(EXACT(UPPER(L63),L63),\"C\",\"CV\")))","v":""},{"$f":"IF(AP63=\"CV\",IF(ISNA(MATCH(L63,Arrays!$G$3:$G$58,0)),INDEX(Arrays!$G$3:$H$58,MATCH(L63,Arrays!$H$3:$H$58,0),1),UPPER(L63)),\"\")","v":""},"","","","","",{"$f":"IF(O63=\"\",\"\",IF(ISNA(MATCH(O63,Arrays!$G$60:$G$65,0)),\"NC\",IF(EXACT(UPPER(O63),O63),\"C\",\"CV\")))","v":""},""]
["","","",null,null,null,null,null,null,null,null,null,null,null,null,"","","",null,"","","",{"$f":"IF(E64<>\"\",LEN(SUM(MID(0&E64,LARGE(ISNUMBER(--MID(E64,ROW(INDIRECT(\"1:\"&LEN(E64))),1))* ROW(INDIRECT(\"1:\"&LEN(E64))),ROW(INDIRECT(\"1:\"&LEN(E64))))+1,1)*10^ROW(INDIRECT(\"1:\"&LEN(E64)))/10)),\"\")","v":""},"","","","","","","","","","","","",{"$f":"IF(J64=\"\",\"\",IF(ISNA(MATCH(J64,Arrays!$G$3:$G$58,0)),IF(ISNA(MATCH(J64,Arrays!$H$3:$H$58,0)),\"NC\",\"CV\"),IF(EXACT(UPPER(J64),J64),\"C\",\"CV\")))","v":""},{"$f":"IF(AJ64=\"CV\",IF(ISNA(MATCH(J64,Arrays!$G$3:$G$58,0)),INDEX(Arrays!$G$3:$H$58,MATCH(J64,Arrays!$H$3:$H$58,0),1),UPPER(J64)),\"\")","v":""},{"$f":"IF(K64=\"\",\"\",LEN(SUM(MID(0&K64,LARGE(ISNUMBER(--MID(K64,ROW(INDIRECT(\"1:\"&LEN(K64))),1))* ROW(INDIRECT(\"1:\"&LEN(K64))),ROW(INDIRECT(\"1:\"&LEN(K64))))+1,1)*10^ROW(INDIRECT(\"1:\"&LEN(K64)))/10)))","v":""},"","",{"$f":"IF(AN64<>\"CV\",IF(AM64=\"CV\",LEFT(K64,5)&\"-\"&RIGHT(K64,4),\"\"),IF(LEN(K64)=5,TEXT(K64,\"#\"),IF(AN64=\"CV\",LEFT(K64,5)&\"-\"&RIGHT(K64,4),IF(AND(LEN(K64)=3,(COUNTIFS(Arrays!$I$3:$I$7,'Data Entry Worksheet'!#REF!,Arrays!$K$3:$K$7,LEFT(K64,1))+COUNTIFS(Arrays!$J$3:$J$7,'Data Entry Worksheet'!#REF!,Arrays!$K$3:$K$7,LEFT(K64,1)))>0),\"00\"&TEXT(K64,\"#\"),IF(AND(LEN(K64)=4,(COUNTIFS(Arrays!$M$3:$M$13,'Data Entry Worksheet'!#REF!,Arrays!$O$3:$O$13,LEFT(K64,1))+COUNTIFS(Arrays!$N$3:$N$13,'Data Entry Worksheet'!#REF!,Arrays!$O$3:$O$13,LEFT(K64,1)))>0),\"0\"&TEXT(K64,\"#\"),\"\")))))","v":""},{"$f":"IF(L64=\"\",\"\",IF(ISNA(MATCH(L64,Arrays!$G$3:$G$58,0)),IF(ISNA(MATCH(L64,Arrays!$H$3:$H$58,0)),\"NC\",\"CV\"),IF(EXACT(UPPER(L64),L64),\"C\",\"CV\")))","v":""},{"$f":"IF(AP64=\"CV\",IF(ISNA(MATCH(L64,Arrays!$G$3:$G$58,0)),INDEX(Arrays!$G$3:$H$58,MATCH(L64,Arrays!$H$3:$H$58,0),1),UPPER(L64)),\"\")","v":""},"","","","","",{"$f":"IF(O64=\"\",\"\",IF(ISNA(MATCH(O64,Arrays!$G$60:$G$65,0)),\"NC\",IF(EXACT(UPPER(O64),O64),\"C\",\"CV\")))","v":""},""]
["","","",null,null,null,null,null,null,null,null,null,null,null,null,"","","",null,"","","",{"$f":"IF(E65<>\"\",LEN(SUM(MID(0&E65,LARGE(ISNUMBER(--MID(E65,ROW(INDIRECT(\"1:\"&LEN(E65))),1))* ROW(INDIRECT(\"1:\"&LEN(E65))),ROW(INDIRECT(\"1:\"&LEN(E65))))+1,1)*10^ROW(INDIRECT(\"1:\"&LEN(E65)))/10)),\"\")","v":""},"","","","","","","","","","","","",{"$f":"IF(J65=\"\",\"\",IF(ISNA(MATCH(J65,Arrays!$G$3:$G$58,0)),IF(ISNA(MATCH(J65,Arrays!$H$3:$H$58,0)),\"NC\",\"CV\"),IF(EXACT(UPPER(J65),J65),\"C\",\"CV\")))","v":""},{"$f":"IF(AJ65=\"CV\",IF(ISNA(MATCH(J65,Arrays!$G$3:$G$58,0)),INDEX(Arrays!$G$3:$H$58,MATCH(J65,Arrays!$H$3:$H$58,0),1),UPPER(J65)),\"\")","v":""},{"$f":"IF(K65=\"\",\"\",LEN(SUM(MID(0&K65,LARGE(ISNUMBER(--MID(K65,ROW(INDIRECT(\"1:\"&LEN(K65))),1))* ROW(INDIRECT(\"1:\"&LEN(K65))),ROW(INDIRECT(\"1:\"&LEN(K65))))+1,1)*10^ROW(INDIRECT(\"1:\"&LEN(K65)))/10)))","v":""},"","",{"$f":"IF(AN65<>\"CV\",IF(AM65=\"CV\",LEFT(K65,5)&\"-\"&RIGHT(K65,4),\"\"),IF(LEN(K65)=5,TEXT(K65,\"#\"),IF(AN65=\"CV\",LEFT(K65,5)&\"-\"&RIGHT(K65,4),IF(AND(LEN(K65)=3,(COUNTIFS(Arrays!$I$3:$I$7,'Data Entry Worksheet'!#REF!,Arrays!$K$3:$K$7,LEFT(K65,1))+COUNTIFS(Arrays!$J$3:$J$7,'Data Entry Worksheet'!#REF!,Arrays!$K$3:$K$7,LEFT(K65,1)))>0),\"00\"&TEXT(K65,\"#\"),IF(AND(LEN(K65)=4,(COUNTIFS(Arrays!$M$3:$M$13,'Data Entry Worksheet'!#REF!,Arrays!$O$3:$O$13,LEFT(K65,1))+COUNTIFS(Arrays!$N$3:$N$13,'Data Entry Worksheet'!#REF!,Arrays!$O$3:$O$13,LEFT(K65,1)))>0),\"0\"&TEXT(K65,\"#\"),\"\")))))","v":""},{"$f":"IF(L65=\"\",\"\",IF(ISNA(MATCH(L65,Arrays!$G$3:$G$58,0)),IF(ISNA(MATCH(L65,Arrays!$H$3:$H$58,0)),\"NC\",\"CV\"),IF(EXACT(UPPER(L65),L65),\"C\",\"CV\")))","v":""},{"$f":"IF(AP65=\"CV\",IF(ISNA(MATCH(L65,Arrays!$G$3:$G$58,0)),INDEX(Arrays!$G$3:$H$58,MATCH(L65,Arrays!$H$3:$H$58,0),1),UPPER(L65)),\"\")","v":""},"","","","","",{"$f":"IF(O65=\"\",\"\",IF(ISNA(MATCH(O65,Arrays!$G$60:$G$65,0)),\"NC\",IF(EXACT(UPPER(O65),O65),\"C\",\"CV\")))","v":""},""]
["","","",null,null,null,null,null,null,null,null,null,null,null,null,"","","",null,"","","",{"$f":"IF(E66<>\"\",LEN(SUM(MID(0&E66,LARGE(ISNUMBER(--MID(E66,ROW(INDIRECT(\"1:\"&LEN(E66))),1))* ROW(INDIRECT(\"1:\"&LEN(E66))),ROW(INDIRECT(\"1:\"&LEN(E66))))+1,1)*10^ROW(INDIRECT(\"1:\"&LEN(E66)))/10)),\"\")","v":""},"","","","","","","","","","","","",{"$f":"IF(J66=\"\",\"\",IF(ISNA(MATCH(J66,Arrays!$G$3:$G$58,0)),IF(ISNA(MATCH(J66,Arrays!$H$3:$H$58,0)),\"NC\",\"CV\"),IF(EXACT(UPPER(J66),J66),\"C\",\"CV\")))","v":""},{"$f":"IF(AJ66=\"CV\",IF(ISNA(MATCH(J66,Arrays!$G$3:$G$58,0)),INDEX(Arrays!$G$3:$H$58,MATCH(J66,Arrays!$H$3:$H$58,0),1),UPPER(J66)),\"\")","v":""},{"$f":"IF(K66=\"\",\"\",LEN(SUM(MID(0&K66,LARGE(ISNUMBER(--MID(K66,ROW(INDIRECT(\"1:\"&LEN(K66))),1))* ROW(INDIRECT(\"1:\"&LEN(K66))),ROW(INDIRECT(\"1:\"&LEN(K66))))+1,1)*10^ROW(INDIRECT(\"1:\"&LEN(K66)))/10)))","v":""},"","",{"$f":"IF(AN66<>\"CV\",IF(AM66=\"CV\",LEFT(K66,5)&\"-\"&RIGHT(K66,4),\"\"),IF(LEN(K66)=5,TEXT(K66,\"#\"),IF(AN66=\"CV\",LEFT(K66,5)&\"-\"&RIGHT(K66,4),IF(AND(LEN(K66)=3,(COUNTIFS(Arrays!$I$3:$I$7,'Data Entry Worksheet'!#REF!,Arrays!$K$3:$K$7,LEFT(K66,1))+COUNTIFS(Arrays!$J$3:$J$7,'Data Entry Worksheet'!#REF!,Arrays!$K$3:$K$7,LEFT(K66,1)))>0),\"00\"&TEXT(K66,\"#\"),IF(AND(LEN(K66)=4,(COUNTIFS(Arrays!$M$3:$M$13,'Data Entry Worksheet'!#REF!,Arrays!$O$3:$O$13,LEFT(K66,1))+COUNTIFS(Arrays!$N$3:$N$13,'Data Entry Worksheet'!#REF!,Arrays!$O$3:$O$13,LEFT(K66,1)))>0),\"0\"&TEXT(K66,\"#\"),\"\")))))","v":""},{"$f":"IF(L66=\"\",\"\",IF(ISNA(MATCH(L66,Arrays!$G$3:$G$58,0)),IF(ISNA(MATCH(L66,Arrays!$H$3:$H$58,0)),\"NC\",\"CV\"),IF(EXACT(UPPER(L66),L66),\"C\",\"CV\")))","v":""},{"$f":"IF(AP66=\"CV\",IF(ISNA(MATCH(L66,Arrays!$G$3:$G$58,0)),INDEX(Arrays!$G$3:$H$58,MATCH(L66,Arrays!$H$3:$H$58,0),1),UPPER(L66)),\"\")","v":""},"","","","","",{"$f":"IF(O66=\"\",\"\",IF(ISNA(MATCH(O66,Arrays!$G$60:$G$65,0)),\"NC\",IF(EXACT(UPPER(O66),O66),\"C\",\"CV\")))","v":""},""]
["","","",null,null,null,null,null,null,null,null,null,null,null,null,"","","",null,"","","",{"$f":"IF(E67<>\"\",LEN(SUM(MID(0&E67,LARGE(ISNUMBER(--MID(E67,ROW(INDIRECT(\"1:\"&LEN(E67))),1))* ROW(INDIRECT(\"1:\"&LEN(E67))),ROW(INDIRECT(\"1:\"&LEN(E67))))+1,1)*10^ROW(INDIRECT(\"1:\"&LEN(E67)))/10)),\"\")","v":""},"","","","","","","","","","","","",{"$f":"IF(J67=\"\",\"\",IF(ISNA(MATCH(J67,Arrays!$G$3:$G$58,0)),IF(ISNA(MATCH(J67,Arrays!$H$3:$H$58,0)),\"NC\",\"CV\"),IF(EXACT(UPPER(J67),J67),\"C\",\"CV\")))","v":""},{"$f":"IF(AJ67=\"CV\",IF(ISNA(MATCH(J67,Arrays!$G$3:$G$58,0)),INDEX(Arrays!$G$3:$H$58,MATCH(J67,Arrays!$H$3:$H$58,0),1),UPPER(J67)),\"\")","v":""},{"$f":"IF(K67=\"\",\"\",LEN(SUM(MID(0&K67,LARGE(ISNUMBER(--MID(K67,ROW(INDIRECT(\"1:\"&LEN(K67))),1))* ROW(INDIRECT(\"1:\"&LEN(K67))),ROW(INDIRECT(\"1:\"&LEN(K67))))+1,1)*10^ROW(INDIRECT(\"1:\"&LEN(K67)))/10)))","v":""},"","",{"$f":"IF(AN67<>\"CV\",IF(AM67=\"CV\",LEFT(K67,5)&\"-\"&RIGHT(K67,4),\"\"),IF(LEN(K67)=5,TEXT(K67,\"#\"),IF(AN67=\"CV\",LEFT(K67,5)&\"-\"&RIGHT(K67,4),IF(AND(LEN(K67)=3,(COUNTIFS(Arrays!$I$3:$I$7,'Data Entry Worksheet'!#REF!,Arrays!$K$3:$K$7,LEFT(K67,1))+COUNTIFS(Arrays!$J$3:$J$7,'Data Entry Worksheet'!#REF!,Arrays!$K$3:$K$7,LEFT(K67,1)))>0),\"00\"&TEXT(K67,\"#\"),IF(AND(LEN(K67)=4,(COUNTIFS(Arrays!$M$3:$M$13,'Data Entry Worksheet'!#REF!,Arrays!$O$3:$O$13,LEFT(K67,1))+COUNTIFS(Arrays!$N$3:$N$13,'Data Entry Worksheet'!#REF!,Arrays!$O$3:$O$13,LEFT(K67,1)))>0),\"0\"&TEXT(K67,\"#\"),\"\")))))","v":""},{"$f":"IF(L67=\"\",\"\",IF(ISNA(MATCH(L67,Arrays!$G$3:$G$58,0)),IF(ISNA(MATCH(L67,Arrays!$H$3:$H$58,0)),\"NC\",\"CV\"),IF(EXACT(UPPER(L67),L67),\"C\",\"CV\")))","v":""},{"$f":"IF(AP67=\"CV\",IF(ISNA(MATCH(L67,Arrays!$G$3:$G$58,0)),INDEX(Arrays!$G$3:$H$58,MATCH(L67,Arrays!$H$3:$H$58,0),1),UPPER(L67)),\"\")","v":""},"","","","","",{"$f":"IF(O67=\"\",\"\",IF(ISNA(MATCH(O67,Arrays!$G$60:$G$65,0)),\"NC\",IF(EXACT(UPPER(O67),O67),\"C\",\"CV\")))","v":""},""]
["","","",null,null,null,null,null,null,null,null,null,null,null,null,"","","",null,"","","",{"$f":"IF(E68<>\"\",LEN(SUM(MID(0&E68,LARGE(ISNUMBER(--MID(E68,ROW(INDIRECT(\"1:\"&LEN(E68))),1))* ROW(INDIRECT(\"1:\"&LEN(E68))),ROW(INDIRECT(\"1:\"&LEN(E68))))+1,1)*10^ROW(INDIRECT(\"1:\"&LEN(E68)))/10)),\"\")","v":""},"","","","","","","","","","","","",{"$f":"IF(J68=\"\",\"\",IF(ISNA(MATCH(J68,Arrays!$G$3:$G$58,0)),IF(ISNA(MATCH(J68,Arrays!$H$3:$H$58,0)),\"NC\",\"CV\"),IF(EXACT(UPPER(J68),J68),\"C\",\"CV\")))","v":""},{"$f":"IF(AJ68=\"CV\",IF(ISNA(MATCH(J68,Arrays!$G$3:$G$58,0)),INDEX(Arrays!$G$3:$H$58,MATCH(J68,Arrays!$H$3:$H$58,0),1),UPPER(J68)),\"\")","v":""},{"$f":"IF(K68=\"\",\"\",LEN(SUM(MID(0&K68,LARGE(ISNUMBER(--MID(K68,ROW(INDIRECT(\"1:\"&LEN(K68))),1))* ROW(INDIRECT(\"1:\"&LEN(K68))),ROW(INDIRECT(\"1:\"&LEN(K68))))+1,1)*10^ROW(INDIRECT(\"1:\"&LEN(K68)))/10)))","v":""},"","",{"$f":"IF(AN68<>\"CV\",IF(AM68=\"CV\",LEFT(K68,5)&\"-\"&RIGHT(K68,4),\"\"),IF(LEN(K68)=5,TEXT(K68,\"#\"),IF(AN68=\"CV\",LEFT(K68,5)&\"-\"&RIGHT(K68,4),IF(AND(LEN(K68)=3,(COUNTIFS(Arrays!$I$3:$I$7,'Data Entry Worksheet'!#REF!,Arrays!$K$3:$K$7,LEFT(K68,1))+COUNTIFS(Arrays!$J$3:$J$7,'Data Entry Worksheet'!#REF!,Arrays!$K$3:$K$7,LEFT(K68,1)))>0),\"00\"&TEXT(K68,\"#\"),IF(AND(LEN(K68)=4,(COUNTIFS(Arrays!$M$3:$M$13,'Data Entry Worksheet'!#REF!,Arrays!$O$3:$O$13,LEFT(K68,1))+COUNTIFS(Arrays!$N$3:$N$13,'Data Entry Worksheet'!#REF!,Arrays!$O$3:$O$13,LEFT(K68,1)))>0),\"0\"&TEXT(K68,\"#\"),\"\")))))","v":""},{"$f":"IF(L68=\"\",\"\",IF(ISNA(MATCH(L68,Arrays!$G$3:$G$58,0)),IF(ISNA(MATCH(L68,Arrays!$H$3:$H$58,0)),\"NC\",\"CV\"),IF(EXACT(UPPER(L68),L68),\"C\",\"CV\")))","v":""},{"$f":"IF(AP68=\"CV\",IF(ISNA(MATCH(L68,Arrays!$G$3:$G$58,0)),INDEX(Arrays!$G$3:$H$58,MATCH(L68,Arrays!$H$3:$H$58,0),1),UPPER(L68)),\"\")","v":""},"","","","","",{"$f":"IF(O68=\"\",\"\",IF(ISNA(MATCH(O68,Arrays!$G$60:$G$65,0)),\"NC\",IF(EXACT(UPPER(O68),O68),\"C\",\"CV\")))","v":""},""]
["","","",null,null,null,null,null,null,null,null,null,null,null,null,"","","",null,"","","",{"$f":"IF(E69<>\"\",LEN(SUM(MID(0&E69,LARGE(ISNUMBER(--MID(E69,ROW(INDIRECT(\"1:\"&LEN(E69))),1))* ROW(INDIRECT(\"1:\"&LEN(E69))),ROW(INDIRECT(\"1:\"&LEN(E69))))+1,1)*10^ROW(INDIRECT(\"1:\"&LEN(E69)))/10)),\"\")","v":""},"","","","","","","","","","","","",{"$f":"IF(J69=\"\",\"\",IF(ISNA(MATCH(J69,Arrays!$G$3:$G$58,0)),IF(ISNA(MATCH(J69,Arrays!$H$3:$H$58,0)),\"NC\",\"CV\"),IF(EXACT(UPPER(J69),J69),\"C\",\"CV\")))","v":""},{"$f":"IF(AJ69=\"CV\",IF(ISNA(MATCH(J69,Arrays!$G$3:$G$58,0)),INDEX(Arrays!$G$3:$H$58,MATCH(J69,Arrays!$H$3:$H$58,0),1),UPPER(J69)),\"\")","v":""},{"$f":"IF(K69=\"\",\"\",LEN(SUM(MID(0&K69,LARGE(ISNUMBER(--MID(K69,ROW(INDIRECT(\"1:\"&LEN(K69))),1))* ROW(INDIRECT(\"1:\"&LEN(K69))),ROW(INDIRECT(\"1:\"&LEN(K69))))+1,1)*10^ROW(INDIRECT(\"1:\"&LEN(K69)))/10)))","v":""},"","",{"$f":"IF(AN69<>\"CV\",IF(AM69=\"CV\",LEFT(K69,5)&\"-\"&RIGHT(K69,4),\"\"),IF(LEN(K69)=5,TEXT(K69,\"#\"),IF(AN69=\"CV\",LEFT(K69,5)&\"-\"&RIGHT(K69,4),IF(AND(LEN(K69)=3,(COUNTIFS(Arrays!$I$3:$I$7,'Data Entry Worksheet'!#REF!,Arrays!$K$3:$K$7,LEFT(K69,1))+COUNTIFS(Arrays!$J$3:$J$7,'Data Entry Worksheet'!#REF!,Arrays!$K$3:$K$7,LEFT(K69,1)))>0),\"00\"&TEXT(K69,\"#\"),IF(AND(LEN(K69)=4,(COUNTIFS(Arrays!$M$3:$M$13,'Data Entry Worksheet'!#REF!,Arrays!$O$3:$O$13,LEFT(K69,1))+COUNTIFS(Arrays!$N$3:$N$13,'Data Entry Worksheet'!#REF!,Arrays!$O$3:$O$13,LEFT(K69,1)))>0),\"0\"&TEXT(K69,\"#\"),\"\")))))","v":""},{"$f":"IF(L69=\"\",\"\",IF(ISNA(MATCH(L69,Arrays!$G$3:$G$58,0)),IF(ISNA(MATCH(L69,Arrays!$H$3:$H$58,0)),\"NC\",\"CV\"),IF(EXACT(UPPER(L69),L69),\"C\",\"CV\")))","v":""},{"$f":"IF(AP69=\"CV\",IF(ISNA(MATCH(L69,Arrays!$G$3:$G$58,0)),INDEX(Arrays!$G$3:$H$58,MATCH(L69,Arrays!$H$3:$H$58,0),1),UPPER(L69)),\"\")","v":""},"","","","","",{"$f":"IF(O69=\"\",\"\",IF(ISNA(MATCH(O69,Arrays!$G$60:$G$65,0)),\"NC\",IF(EXACT(UPPER(O69),O69),\"C\",\"CV\")))","v":""},""]
["","","",null,null,null,null,null,null,null,null,null,null,null,null,"","","",null,"","","",{"$f":"IF(E70<>\"\",LEN(SUM(MID(0&E70,LARGE(ISNUMBER(--MID(E70,ROW(INDIRECT(\"1:\"&LEN(E70))),1))* ROW(INDIRECT(\"1:\"&LEN(E70))),ROW(INDIRECT(\"1:\"&LEN(E70))))+1,1)*10^ROW(INDIRECT(\"1:\"&LEN(E70)))/10)),\"\")","v":""},"","","","","","","","","","","","",{"$f":"IF(J70=\"\",\"\",IF(ISNA(MATCH(J70,Arrays!$G$3:$G$58,0)),IF(ISNA(MATCH(J70,Arrays!$H$3:$H$58,0)),\"NC\",\"CV\"),IF(EXACT(UPPER(J70),J70),\"C\",\"CV\")))","v":""},{"$f":"IF(AJ70=\"CV\",IF(ISNA(MATCH(J70,Arrays!$G$3:$G$58,0)),INDEX(Arrays!$G$3:$H$58,MATCH(J70,Arrays!$H$3:$H$58,0),1),UPPER(J70)),\"\")","v":""},{"$f":"IF(K70=\"\",\"\",LEN(SUM(MID(0&K70,LARGE(ISNUMBER(--MID(K70,ROW(INDIRECT(\"1:\"&LEN(K70))),1))* ROW(INDIRECT(\"1:\"&LEN(K70))),ROW(INDIRECT(\"1:\"&LEN(K70))))+1,1)*10^ROW(INDIRECT(\"1:\"&LEN(K70)))/10)))","v":""},"","",{"$f":"IF(AN70<>\"CV\",IF(AM70=\"CV\",LEFT(K70,5)&\"-\"&RIGHT(K70,4),\"\"),IF(LEN(K70)=5,TEXT(K70,\"#\"),IF(AN70=\"CV\",LEFT(K70,5)&\"-\"&RIGHT(K70,4),IF(AND(LEN(K70)=3,(COUNTIFS(Arrays!$I$3:$I$7,'Data Entry Worksheet'!#REF!,Arrays!$K$3:$K$7,LEFT(K70,1))+COUNTIFS(Arrays!$J$3:$J$7,'Data Entry Worksheet'!#REF!,Arrays!$K$3:$K$7,LEFT(K70,1)))>0),\"00\"&TEXT(K70,\"#\"),IF(AND(LEN(K70)=4,(COUNTIFS(Arrays!$M$3:$M$13,'Data Entry Worksheet'!#REF!,Arrays!$O$3:$O$13,LEFT(K70,1))+COUNTIFS(Arrays!$N$3:$N$13,'Data Entry Worksheet'!#REF!,Arrays!$O$3:$O$13,LEFT(K70,1)))>0),\"0\"&TEXT(K70,\"#\"),\"\")))))","v":""},{"$f":"IF(L70=\"\",\"\",IF(ISNA(MATCH(L70,Arrays!$G$3:$G$58,0)),IF(ISNA(MATCH(L70,Arrays!$H$3:$H$58,0)),\"NC\",\"CV\"),IF(EXACT(UPPER(L70),L70),\"C\",\"CV\")))","v":""},{"$f":"IF(AP70=\"CV\",IF(ISNA(MATCH(L70,Arrays!$G$3:$G$58,0)),INDEX(Arrays!$G$3:$H$58,MATCH(L70,Arrays!$H$3:$H$58,0),1),UPPER(L70)),\"\")","v":""},"","","","","",{"$f":"IF(O70=\"\",\"\",IF(ISNA(MATCH(O70,Arrays!$G$60:$G$65,0)),\"NC\",IF(EXACT(UPPER(O70),O70),\"C\",\"CV\")))","v":""},""]
["","","",null,null,null,null,null,null,null,null,null,null,null,null,"","","",null,"","","",{"$f":"IF(E71<>\"\",LEN(SUM(MID(0&E71,LARGE(ISNUMBER(--MID(E71,ROW(INDIRECT(\"1:\"&LEN(E71))),1))* ROW(INDIRECT(\"1:\"&LEN(E71))),ROW(INDIRECT(\"1:\"&LEN(E71))))+1,1)*10^ROW(INDIRECT(\"1:\"&LEN(E71)))/10)),\"\")","v":""},"","","","","","","","","","","","",{"$f":"IF(J71=\"\",\"\",IF(ISNA(MATCH(J71,Arrays!$G$3:$G$58,0)),IF(ISNA(MATCH(J71,Arrays!$H$3:$H$58,0)),\"NC\",\"CV\"),IF(EXACT(UPPER(J71),J71),\"C\",\"CV\")))","v":""},{"$f":"IF(AJ71=\"CV\",IF(ISNA(MATCH(J71,Arrays!$G$3:$G$58,0)),INDEX(Arrays!$G$3:$H$58,MATCH(J71,Arrays!$H$3:$H$58,0),1),UPPER(J71)),\"\")","v":""},{"$f":"IF(K71=\"\",\"\",LEN(SUM(MID(0&K71,LARGE(ISNUMBER(--MID(K71,ROW(INDIRECT(\"1:\"&LEN(K71))),1))* ROW(INDIRECT(\"1:\"&LEN(K71))),ROW(INDIRECT(\"1:\"&LEN(K71))))+1,1)*10^ROW(INDIRECT(\"1:\"&LEN(K71)))/10)))","v":""},"","",{"$f":"IF(AN71<>\"CV\",IF(AM71=\"CV\",LEFT(K71,5)&\"-\"&RIGHT(K71,4),\"\"),IF(LEN(K71)=5,TEXT(K71,\"#\"),IF(AN71=\"CV\",LEFT(K71,5)&\"-\"&RIGHT(K71,4),IF(AND(LEN(K71)=3,(COUNTIFS(Arrays!$I$3:$I$7,'Data Entry Worksheet'!#REF!,Arrays!$K$3:$K$7,LEFT(K71,1))+COUNTIFS(Arrays!$J$3:$J$7,'Data Entry Worksheet'!#REF!,Arrays!$K$3:$K$7,LEFT(K71,1)))>0),\"00\"&TEXT(K71,\"#\"),IF(AND(LEN(K71)=4,(COUNTIFS(Arrays!$M$3:$M$13,'Data Entry Worksheet'!#REF!,Arrays!$O$3:$O$13,LEFT(K71,1))+COUNTIFS(Arrays!$N$3:$N$13,'Data Entry Worksheet'!#REF!,Arrays!$O$3:$O$13,LEFT(K71,1)))>0),\"0\"&TEXT(K71,\"#\"),\"\")))))","v":""},{"$f":"IF(L71=\"\",\"\",IF(ISNA(MATCH(L71,Arrays!$G$3:$G$58,0)),IF(ISNA(MATCH(L71,Arrays!$H$3:$H$58,0)),\"NC\",\"CV\"),IF(EXACT(UPPER(L71),L71),\"C\",\"CV\")))","v":""},{"$f":"IF(AP71=\"CV\",IF(ISNA(MATCH(L71,Arrays!$G$3:$G$58,0)),INDEX(Arrays!$G$3:$H$58,MATCH(L71,Arrays!$H$3:$H$58,0),1),UPPER(L71)),\"\")","v":""},"","","","","",{"$f":"IF(O71=\"\",\"\",IF(ISNA(MATCH(O71,Arrays!$G$60:$G$65,0)),\"NC\",IF(EXACT(UPPER(O71),O71),\"C\",\"CV\")))","v":""},""]
["","","",null,null,null,null,null,null,null,null,null,null,null,null,"","","",null,"","","",{"$f":"IF(E72<>\"\",LEN(SUM(MID(0&E72,LARGE(ISNUMBER(--MID(E72,ROW(INDIRECT(\"1:\"&LEN(E72))),1))* ROW(INDIRECT(\"1:\"&LEN(E72))),ROW(INDIRECT(\"1:\"&LEN(E72))))+1,1)*10^ROW(INDIRECT(\"1:\"&LEN(E72)))/10)),\"\")","v":""},"","","","","","","","","","","","",{"$f":"IF(J72=\"\",\"\",IF(ISNA(MATCH(J72,Arrays!$G$3:$G$58,0)),IF(ISNA(MATCH(J72,Arrays!$H$3:$H$58,0)),\"NC\",\"CV\"),IF(EXACT(UPPER(J72),J72),\"C\",\"CV\")))","v":""},{"$f":"IF(AJ72=\"CV\",IF(ISNA(MATCH(J72,Arrays!$G$3:$G$58,0)),INDEX(Arrays!$G$3:$H$58,MATCH(J72,Arrays!$H$3:$H$58,0),1),UPPER(J72)),\"\")","v":""},{"$f":"IF(K72=\"\",\"\",LEN(SUM(MID(0&K72,LARGE(ISNUMBER(--MID(K72,ROW(INDIRECT(\"1:\"&LEN(K72))),1))* ROW(INDIRECT(\"1:\"&LEN(K72))),ROW(INDIRECT(\"1:\"&LEN(K72))))+1,1)*10^ROW(INDIRECT(\"1:\"&LEN(K72)))/10)))","v":""},"","",{"$f":"IF(AN72<>\"CV\",IF(AM72=\"CV\",LEFT(K72,5)&\"-\"&RIGHT(K72,4),\"\"),IF(LEN(K72)=5,TEXT(K72,\"#\"),IF(AN72=\"CV\",LEFT(K72,5)&\"-\"&RIGHT(K72,4),IF(AND(LEN(K72)=3,(COUNTIFS(Arrays!$I$3:$I$7,'Data Entry Worksheet'!#REF!,Arrays!$K$3:$K$7,LEFT(K72,1))+COUNTIFS(Arrays!$J$3:$J$7,'Data Entry Worksheet'!#REF!,Arrays!$K$3:$K$7,LEFT(K72,1)))>0),\"00\"&TEXT(K72,\"#\"),IF(AND(LEN(K72)=4,(COUNTIFS(Arrays!$M$3:$M$13,'Data Entry Worksheet'!#REF!,Arrays!$O$3:$O$13,LEFT(K72,1))+COUNTIFS(Arrays!$N$3:$N$13,'Data Entry Worksheet'!#REF!,Arrays!$O$3:$O$13,LEFT(K72,1)))>0),\"0\"&TEXT(K72,\"#\"),\"\")))))","v":""},{"$f":"IF(L72=\"\",\"\",IF(ISNA(MATCH(L72,Arrays!$G$3:$G$58,0)),IF(ISNA(MATCH(L72,Arrays!$H$3:$H$58,0)),\"NC\",\"CV\"),IF(EXACT(UPPER(L72),L72),\"C\",\"CV\")))","v":""},{"$f":"IF(AP72=\"CV\",IF(ISNA(MATCH(L72,Arrays!$G$3:$G$58,0)),INDEX(Arrays!$G$3:$H$58,MATCH(L72,Arrays!$H$3:$H$58,0),1),UPPER(L72)),\"\")","v":""},"","","","","",{"$f":"IF(O72=\"\",\"\",IF(ISNA(MATCH(O72,Arrays!$G$60:$G$65,0)),\"NC\",IF(EXACT(UPPER(O72),O72),\"C\",\"CV\")))","v":""},""]
["","","",null,null,null,null,null,null,null,null,null,null,null,null,"","","",null,"","","",{"$f":"IF(E73<>\"\",LEN(SUM(MID(0&E73,LARGE(ISNUMBER(--MID(E73,ROW(INDIRECT(\"1:\"&LEN(E73))),1))* ROW(INDIRECT(\"1:\"&LEN(E73))),ROW(INDIRECT(\"1:\"&LEN(E73))))+1,1)*10^ROW(INDIRECT(\"1:\"&LEN(E73)))/10)),\"\")","v":""},"","","","","","","","","","","","",{"$f":"IF(J73=\"\",\"\",IF(ISNA(MATCH(J73,Arrays!$G$3:$G$58,0)),IF(ISNA(MATCH(J73,Arrays!$H$3:$H$58,0)),\"NC\",\"CV\"),IF(EXACT(UPPER(J73),J73),\"C\",\"CV\")))","v":""},{"$f":"IF(AJ73=\"CV\",IF(ISNA(MATCH(J73,Arrays!$G$3:$G$58,0)),INDEX(Arrays!$G$3:$H$58,MATCH(J73,Arrays!$H$3:$H$58,0),1),UPPER(J73)),\"\")","v":""},{"$f":"IF(K73=\"\",\"\",LEN(SUM(MID(0&K73,LARGE(ISNUMBER(--MID(K73,ROW(INDIRECT(\"1:\"&LEN(K73))),1))* ROW(INDIRECT(\"1:\"&LEN(K73))),ROW(INDIRECT(\"1:\"&LEN(K73))))+1,1)*10^ROW(INDIRECT(\"1:\"&LEN(K73)))/10)))","v":""},"","",{"$f":"IF(AN73<>\"CV\",IF(AM73=\"CV\",LEFT(K73,5)&\"-\"&RIGHT(K73,4),\"\"),IF(LEN(K73)=5,TEXT(K73,\"#\"),IF(AN73=\"CV\",LEFT(K73,5)&\"-\"&RIGHT(K73,4),IF(AND(LEN(K73)=3,(COUNTIFS(Arrays!$I$3:$I$7,'Data Entry Worksheet'!#REF!,Arrays!$K$3:$K$7,LEFT(K73,1))+COUNTIFS(Arrays!$J$3:$J$7,'Data Entry Worksheet'!#REF!,Arrays!$K$3:$K$7,LEFT(K73,1)))>0),\"00\"&TEXT(K73,\"#\"),IF(AND(LEN(K73)=4,(COUNTIFS(Arrays!$M$3:$M$13,'Data Entry Worksheet'!#REF!,Arrays!$O$3:$O$13,LEFT(K73,1))+COUNTIFS(Arrays!$N$3:$N$13,'Data Entry Worksheet'!#REF!,Arrays!$O$3:$O$13,LEFT(K73,1)))>0),\"0\"&TEXT(K73,\"#\"),\"\")))))","v":""},{"$f":"IF(L73=\"\",\"\",IF(ISNA(MATCH(L73,Arrays!$G$3:$G$58,0)),IF(ISNA(MATCH(L73,Arrays!$H$3:$H$58,0)),\"NC\",\"CV\"),IF(EXACT(UPPER(L73),L73),\"C\",\"CV\")))","v":""},{"$f":"IF(AP73=\"CV\",IF(ISNA(MATCH(L73,Arrays!$G$3:$G$58,0)),INDEX(Arrays!$G$3:$H$58,MATCH(L73,Arrays!$H$3:$H$58,0),1),UPPER(L73)),\"\")","v":""},"","","","","",{"$f":"IF(O73=\"\",\"\",IF(ISNA(MATCH(O73,Arrays!$G$60:$G$65,0)),\"NC\",IF(EXACT(UPPER(O73),O73),\"C\",\"CV\")))","v":""},""]
["","","",null,null,null,null,null,null,null,null,null,null,null,null,"","","",null,"","","",{"$f":"IF(E74<>\"\",LEN(SUM(MID(0&E74,LARGE(ISNUMBER(--MID(E74,ROW(INDIRECT(\"1:\"&LEN(E74))),1))* ROW(INDIRECT(\"1:\"&LEN(E74))),ROW(INDIRECT(\"1:\"&LEN(E74))))+1,1)*10^ROW(INDIRECT(\"1:\"&LEN(E74)))/10)),\"\")","v":""},"","","","","","","","","","","","",{"$f":"IF(J74=\"\",\"\",IF(ISNA(MATCH(J74,Arrays!$G$3:$G$58,0)),IF(ISNA(MATCH(J74,Arrays!$H$3:$H$58,0)),\"NC\",\"CV\"),IF(EXACT(UPPER(J74),J74),\"C\",\"CV\")))","v":""},{"$f":"IF(AJ74=\"CV\",IF(ISNA(MATCH(J74,Arrays!$G$3:$G$58,0)),INDEX(Arrays!$G$3:$H$58,MATCH(J74,Arrays!$H$3:$H$58,0),1),UPPER(J74)),\"\")","v":""},{"$f":"IF(K74=\"\",\"\",LEN(SUM(MID(0&K74,LARGE(ISNUMBER(--MID(K74,ROW(INDIRECT(\"1:\"&LEN(K74))),1))* ROW(INDIRECT(\"1:\"&LEN(K74))),ROW(INDIRECT(\"1:\"&LEN(K74))))+1,1)*10^ROW(INDIRECT(\"1:\"&LEN(K74)))/10)))","v":""},"","",{"$f":"IF(AN74<>\"CV\",IF(AM74=\"CV\",LEFT(K74,5)&\"-\"&RIGHT(K74,4),\"\"),IF(LEN(K74)=5,TEXT(K74,\"#\"),IF(AN74=\"CV\",LEFT(K74,5)&\"-\"&RIGHT(K74,4),IF(AND(LEN(K74)=3,(COUNTIFS(Arrays!$I$3:$I$7,'Data Entry Worksheet'!#REF!,Arrays!$K$3:$K$7,LEFT(K74,1))+COUNTIFS(Arrays!$J$3:$J$7,'Data Entry Worksheet'!#REF!,Arrays!$K$3:$K$7,LEFT(K74,1)))>0),\"00\"&TEXT(K74,\"#\"),IF(AND(LEN(K74)=4,(COUNTIFS(Arrays!$M$3:$M$13,'Data Entry Worksheet'!#REF!,Arrays!$O$3:$O$13,LEFT(K74,1))+COUNTIFS(Arrays!$N$3:$N$13,'Data Entry Worksheet'!#REF!,Arrays!$O$3:$O$13,LEFT(K74,1)))>0),\"0\"&TEXT(K74,\"#\"),\"\")))))","v":""},{"$f":"IF(L74=\"\",\"\",IF(ISNA(MATCH(L74,Arrays!$G$3:$G$58,0)),IF(ISNA(MATCH(L74,Arrays!$H$3:$H$58,0)),\"NC\",\"CV\"),IF(EXACT(UPPER(L74),L74),\"C\",\"CV\")))","v":""},{"$f":"IF(AP74=\"CV\",IF(ISNA(MATCH(L74,Arrays!$G$3:$G$58,0)),INDEX(Arrays!$G$3:$H$58,MATCH(L74,Arrays!$H$3:$H$58,0),1),UPPER(L74)),\"\")","v":""},"","","","","",{"$f":"IF(O74=\"\",\"\",IF(ISNA(MATCH(O74,Arrays!$G$60:$G$65,0)),\"NC\",IF(EXACT(UPPER(O74),O74),\"C\",\"CV\")))","v":""},""]
["","","",null,null,null,null,null,null,null,null,null,null,null,null,"","","",null,"","","",{"$f":"IF(E75<>\"\",LEN(SUM(MID(0&E75,LARGE(ISNUMBER(--MID(E75,ROW(INDIRECT(\"1:\"&LEN(E75))),1))* ROW(INDIRECT(\"1:\"&LEN(E75))),ROW(INDIRECT(\"1:\"&LEN(E75))))+1,1)*10^ROW(INDIRECT(\"1:\"&LEN(E75)))/10)),\"\")","v":""},"","","","","","","","","","","","",{"$f":"IF(J75=\"\",\"\",IF(ISNA(MATCH(J75,Arrays!$G$3:$G$58,0)),IF(ISNA(MATCH(J75,Arrays!$H$3:$H$58,0)),\"NC\",\"CV\"),IF(EXACT(UPPER(J75),J75),\"C\",\"CV\")))","v":""},{"$f":"IF(AJ75=\"CV\",IF(ISNA(MATCH(J75,Arrays!$G$3:$G$58,0)),INDEX(Arrays!$G$3:$H$58,MATCH(J75,Arrays!$H$3:$H$58,0),1),UPPER(J75)),\"\")","v":""},{"$f":"IF(K75=\"\",\"\",LEN(SUM(MID(0&K75,LARGE(ISNUMBER(--MID(K75,ROW(INDIRECT(\"1:\"&LEN(K75))),1))* ROW(INDIRECT(\"1:\"&LEN(K75))),ROW(INDIRECT(\"1:\"&LEN(K75))))+1,1)*10^ROW(INDIRECT(\"1:\"&LEN(K75)))/10)))","v":""},"","",{"$f":"IF(AN75<>\"CV\",IF(AM75=\"CV\",LEFT(K75,5)&\"-\"&RIGHT(K75,4),\"\"),IF(LEN(K75)=5,TEXT(K75,\"#\"),IF(AN75=\"CV\",LEFT(K75,5)&\"-\"&RIGHT(K75,4),IF(AND(LEN(K75)=3,(COUNTIFS(Arrays!$I$3:$I$7,'Data Entry Worksheet'!#REF!,Arrays!$K$3:$K$7,LEFT(K75,1))+COUNTIFS(Arrays!$J$3:$J$7,'Data Entry Worksheet'!#REF!,Arrays!$K$3:$K$7,LEFT(K75,1)))>0),\"00\"&TEXT(K75,\"#\"),IF(AND(LEN(K75)=4,(COUNTIFS(Arrays!$M$3:$M$13,'Data Entry Worksheet'!#REF!,Arrays!$O$3:$O$13,LEFT(K75,1))+COUNTIFS(Arrays!$N$3:$N$13,'Data Entry Worksheet'!#REF!,Arrays!$O$3:$O$13,LEFT(K75,1)))>0),\"0\"&TEXT(K75,\"#\"),\"\")))))","v":""},{"$f":"IF(L75=\"\",\"\",IF(ISNA(MATCH(L75,Arrays!$G$3:$G$58,0)),IF(ISNA(MATCH(L75,Arrays!$H$3:$H$58,0)),\"NC\",\"CV\"),IF(EXACT(UPPER(L75),L75),\"C\",\"CV\")))","v":""},{"$f":"IF(AP75=\"CV\",IF(ISNA(MATCH(L75,Arrays!$G$3:$G$58,0)),INDEX(Arrays!$G$3:$H$58,MATCH(L75,Arrays!$H$3:$H$58,0),1),UPPER(L75)),\"\")","v":""},"","","","","",{"$f":"IF(O75=\"\",\"\",IF(ISNA(MATCH(O75,Arrays!$G$60:$G$65,0)),\"NC\",IF(EXACT(UPPER(O75),O75),\"C\",\"CV\")))","v":""},""]
["","","",null,null,null,null,null,null,null,null,null,null,null,null,"","","",null,"","","",{"$f":"IF(E76<>\"\",LEN(SUM(MID(0&E76,LARGE(ISNUMBER(--MID(E76,ROW(INDIRECT(\"1:\"&LEN(E76))),1))* ROW(INDIRECT(\"1:\"&LEN(E76))),ROW(INDIRECT(\"1:\"&LEN(E76))))+1,1)*10^ROW(INDIRECT(\"1:\"&LEN(E76)))/10)),\"\")","v":""},"","","","","","","","","","","","",{"$f":"IF(J76=\"\",\"\",IF(ISNA(MATCH(J76,Arrays!$G$3:$G$58,0)),IF(ISNA(MATCH(J76,Arrays!$H$3:$H$58,0)),\"NC\",\"CV\"),IF(EXACT(UPPER(J76),J76),\"C\",\"CV\")))","v":""},{"$f":"IF(AJ76=\"CV\",IF(ISNA(MATCH(J76,Arrays!$G$3:$G$58,0)),INDEX(Arrays!$G$3:$H$58,MATCH(J76,Arrays!$H$3:$H$58,0),1),UPPER(J76)),\"\")","v":""},{"$f":"IF(K76=\"\",\"\",LEN(SUM(MID(0&K76,LARGE(ISNUMBER(--MID(K76,ROW(INDIRECT(\"1:\"&LEN(K76))),1))* ROW(INDIRECT(\"1:\"&LEN(K76))),ROW(INDIRECT(\"1:\"&LEN(K76))))+1,1)*10^ROW(INDIRECT(\"1:\"&LEN(K76)))/10)))","v":""},"","",{"$f":"IF(AN76<>\"CV\",IF(AM76=\"CV\",LEFT(K76,5)&\"-\"&RIGHT(K76,4),\"\"),IF(LEN(K76)=5,TEXT(K76,\"#\"),IF(AN76=\"CV\",LEFT(K76,5)&\"-\"&RIGHT(K76,4),IF(AND(LEN(K76)=3,(COUNTIFS(Arrays!$I$3:$I$7,'Data Entry Worksheet'!#REF!,Arrays!$K$3:$K$7,LEFT(K76,1))+COUNTIFS(Arrays!$J$3:$J$7,'Data Entry Worksheet'!#REF!,Arrays!$K$3:$K$7,LEFT(K76,1)))>0),\"00\"&TEXT(K76,\"#\"),IF(AND(LEN(K76)=4,(COUNTIFS(Arrays!$M$3:$M$13,'Data Entry Worksheet'!#REF!,Arrays!$O$3:$O$13,LEFT(K76,1))+COUNTIFS(Arrays!$N$3:$N$13,'Data Entry Worksheet'!#REF!,Arrays!$O$3:$O$13,LEFT(K76,1)))>0),\"0\"&TEXT(K76,\"#\"),\"\")))))","v":""},{"$f":"IF(L76=\"\",\"\",IF(ISNA(MATCH(L76,Arrays!$G$3:$G$58,0)),IF(ISNA(MATCH(L76,Arrays!$H$3:$H$58,0)),\"NC\",\"CV\"),IF(EXACT(UPPER(L76),L76),\"C\",\"CV\")))","v":""},{"$f":"IF(AP76=\"CV\",IF(ISNA(MATCH(L76,Arrays!$G$3:$G$58,0)),INDEX(Arrays!$G$3:$H$58,MATCH(L76,Arrays!$H$3:$H$58,0),1),UPPER(L76)),\"\")","v":""},"","","","","",{"$f":"IF(O76=\"\",\"\",IF(ISNA(MATCH(O76,Arrays!$G$60:$G$65,0)),\"NC\",IF(EXACT(UPPER(O76),O76),\"C\",\"CV\")))","v":""},""]
["","","",null,null,null,null,null,null,null,null,null,null,null,null,"","","",null,"","","",{"$f":"IF(E77<>\"\",LEN(SUM(MID(0&E77,LARGE(ISNUMBER(--MID(E77,ROW(INDIRECT(\"1:\"&LEN(E77))),1))* ROW(INDIRECT(\"1:\"&LEN(E77))),ROW(INDIRECT(\"1:\"&LEN(E77))))+1,1)*10^ROW(INDIRECT(\"1:\"&LEN(E77)))/10)),\"\")","v":""},"","","","","","","","","","","","",{"$f":"IF(J77=\"\",\"\",IF(ISNA(MATCH(J77,Arrays!$G$3:$G$58,0)),IF(ISNA(MATCH(J77,Arrays!$H$3:$H$58,0)),\"NC\",\"CV\"),IF(EXACT(UPPER(J77),J77),\"C\",\"CV\")))","v":""},{"$f":"IF(AJ77=\"CV\",IF(ISNA(MATCH(J77,Arrays!$G$3:$G$58,0)),INDEX(Arrays!$G$3:$H$58,MATCH(J77,Arrays!$H$3:$H$58,0),1),UPPER(J77)),\"\")","v":""},{"$f":"IF(K77=\"\",\"\",LEN(SUM(MID(0&K77,LARGE(ISNUMBER(--MID(K77,ROW(INDIRECT(\"1:\"&LEN(K77))),1))* ROW(INDIRECT(\"1:\"&LEN(K77))),ROW(INDIRECT(\"1:\"&LEN(K77))))+1,1)*10^ROW(INDIRECT(\"1:\"&LEN(K77)))/10)))","v":""},"","",{"$f":"IF(AN77<>\"CV\",IF(AM77=\"CV\",LEFT(K77,5)&\"-\"&RIGHT(K77,4),\"\"),IF(LEN(K77)=5,TEXT(K77,\"#\"),IF(AN77=\"CV\",LEFT(K77,5)&\"-\"&RIGHT(K77,4),IF(AND(LEN(K77)=3,(COUNTIFS(Arrays!$I$3:$I$7,'Data Entry Worksheet'!#REF!,Arrays!$K$3:$K$7,LEFT(K77,1))+COUNTIFS(Arrays!$J$3:$J$7,'Data Entry Worksheet'!#REF!,Arrays!$K$3:$K$7,LEFT(K77,1)))>0),\"00\"&TEXT(K77,\"#\"),IF(AND(LEN(K77)=4,(COUNTIFS(Arrays!$M$3:$M$13,'Data Entry Worksheet'!#REF!,Arrays!$O$3:$O$13,LEFT(K77,1))+COUNTIFS(Arrays!$N$3:$N$13,'Data Entry Worksheet'!#REF!,Arrays!$O$3:$O$13,LEFT(K77,1)))>0),\"0\"&TEXT(K77,\"#\"),\"\")))))","v":""},{"$f":"IF(L77=\"\",\"\",IF(ISNA(MATCH(L77,Arrays!$G$3:$G$58,0)),IF(ISNA(MATCH(L77,Arrays!$H$3:$H$58,0)),\"NC\",\"CV\"),IF(EXACT(UPPER(L77),L77),\"C\",\"CV\")))","v":""},{"$f":"IF(AP77=\"CV\",IF(ISNA(MATCH(L77,Arrays!$G$3:$G$58,0)),INDEX(Arrays!$G$3:$H$58,MATCH(L77,Arrays!$H$3:$H$58,0),1),UPPER(L77)),\"\")","v":""},"","","","","",{"$f":"IF(O77=\"\",\"\",IF(ISNA(MATCH(O77,Arrays!$G$60:$G$65,0)),\"NC\",IF(EXACT(UPPER(O77),O77),\"C\",\"CV\")))","v":""},""]
["","","",null,null,null,null,null,null,null,null,null,null,null,null,"","","",null,"","","",{"$f":"IF(E78<>\"\",LEN(SUM(MID(0&E78,LARGE(ISNUMBER(--MID(E78,ROW(INDIRECT(\"1:\"&LEN(E78))),1))* ROW(INDIRECT(\"1:\"&LEN(E78))),ROW(INDIRECT(\"1:\"&LEN(E78))))+1,1)*10^ROW(INDIRECT(\"1:\"&LEN(E78)))/10)),\"\")","v":""},"","","","","","","","","","","","",{"$f":"IF(J78=\"\",\"\",IF(ISNA(MATCH(J78,Arrays!$G$3:$G$58,0)),IF(ISNA(MATCH(J78,Arrays!$H$3:$H$58,0)),\"NC\",\"CV\"),IF(EXACT(UPPER(J78),J78),\"C\",\"CV\")))","v":""},{"$f":"IF(AJ78=\"CV\",IF(ISNA(MATCH(J78,Arrays!$G$3:$G$58,0)),INDEX(Arrays!$G$3:$H$58,MATCH(J78,Arrays!$H$3:$H$58,0),1),UPPER(J78)),\"\")","v":""},{"$f":"IF(K78=\"\",\"\",LEN(SUM(MID(0&K78,LARGE(ISNUMBER(--MID(K78,ROW(INDIRECT(\"1:\"&LEN(K78))),1))* ROW(INDIRECT(\"1:\"&LEN(K78))),ROW(INDIRECT(\"1:\"&LEN(K78))))+1,1)*10^ROW(INDIRECT(\"1:\"&LEN(K78)))/10)))","v":""},"","",{"$f":"IF(AN78<>\"CV\",IF(AM78=\"CV\",LEFT(K78,5)&\"-\"&RIGHT(K78,4),\"\"),IF(LEN(K78)=5,TEXT(K78,\"#\"),IF(AN78=\"CV\",LEFT(K78,5)&\"-\"&RIGHT(K78,4),IF(AND(LEN(K78)=3,(COUNTIFS(Arrays!$I$3:$I$7,'Data Entry Worksheet'!#REF!,Arrays!$K$3:$K$7,LEFT(K78,1))+COUNTIFS(Arrays!$J$3:$J$7,'Data Entry Worksheet'!#REF!,Arrays!$K$3:$K$7,LEFT(K78,1)))>0),\"00\"&TEXT(K78,\"#\"),IF(AND(LEN(K78)=4,(COUNTIFS(Arrays!$M$3:$M$13,'Data Entry Worksheet'!#REF!,Arrays!$O$3:$O$13,LEFT(K78,1))+COUNTIFS(Arrays!$N$3:$N$13,'Data Entry Worksheet'!#REF!,Arrays!$O$3:$O$13,LEFT(K78,1)))>0),\"0\"&TEXT(K78,\"#\"),\"\")))))","v":""},{"$f":"IF(L78=\"\",\"\",IF(ISNA(MATCH(L78,Arrays!$G$3:$G$58,0)),IF(ISNA(MATCH(L78,Arrays!$H$3:$H$58,0)),\"NC\",\"CV\"),IF(EXACT(UPPER(L78),L78),\"C\",\"CV\")))","v":""},{"$f":"IF(AP78=\"CV\",IF(ISNA(MATCH(L78,Arrays!$G$3:$G$58,0)),INDEX(Arrays!$G$3:$H$58,MATCH(L78,Arrays!$H$3:$H$58,0),1),UPPER(L78)),\"\")","v":""},"","","","","",{"$f":"IF(O78=\"\",\"\",IF(ISNA(MATCH(O78,Arrays!$G$60:$G$65,0)),\"NC\",IF(EXACT(UPPER(O78),O78),\"C\",\"CV\")))","v":""},""]
["","","",null,null,null,null,null,null,null,null,null,null,null,null,"","","",null,"","","",{"$f":"IF(E79<>\"\",LEN(SUM(MID(0&E79,LARGE(ISNUMBER(--MID(E79,ROW(INDIRECT(\"1:\"&LEN(E79))),1))* ROW(INDIRECT(\"1:\"&LEN(E79))),ROW(INDIRECT(\"1:\"&LEN(E79))))+1,1)*10^ROW(INDIRECT(\"1:\"&LEN(E79)))/10)),\"\")","v":""},"","","","","","","","","","","","",{"$f":"IF(J79=\"\",\"\",IF(ISNA(MATCH(J79,Arrays!$G$3:$G$58,0)),IF(ISNA(MATCH(J79,Arrays!$H$3:$H$58,0)),\"NC\",\"CV\"),IF(EXACT(UPPER(J79),J79),\"C\",\"CV\")))","v":""},{"$f":"IF(AJ79=\"CV\",IF(ISNA(MATCH(J79,Arrays!$G$3:$G$58,0)),INDEX(Arrays!$G$3:$H$58,MATCH(J79,Arrays!$H$3:$H$58,0),1),UPPER(J79)),\"\")","v":""},{"$f":"IF(K79=\"\",\"\",LEN(SUM(MID(0&K79,LARGE(ISNUMBER(--MID(K79,ROW(INDIRECT(\"1:\"&LEN(K79))),1))* ROW(INDIRECT(\"1:\"&LEN(K79))),ROW(INDIRECT(\"1:\"&LEN(K79))))+1,1)*10^ROW(INDIRECT(\"1:\"&LEN(K79)))/10)))","v":""},"","",{"$f":"IF(AN79<>\"CV\",IF(AM79=\"CV\",LEFT(K79,5)&\"-\"&RIGHT(K79,4),\"\"),IF(LEN(K79)=5,TEXT(K79,\"#\"),IF(AN79=\"CV\",LEFT(K79,5)&\"-\"&RIGHT(K79,4),IF(AND(LEN(K79)=3,(COUNTIFS(Arrays!$I$3:$I$7,'Data Entry Worksheet'!#REF!,Arrays!$K$3:$K$7,LEFT(K79,1))+COUNTIFS(Arrays!$J$3:$J$7,'Data Entry Worksheet'!#REF!,Arrays!$K$3:$K$7,LEFT(K79,1)))>0),\"00\"&TEXT(K79,\"#\"),IF(AND(LEN(K79)=4,(COUNTIFS(Arrays!$M$3:$M$13,'Data Entry Worksheet'!#REF!,Arrays!$O$3:$O$13,LEFT(K79,1))+COUNTIFS(Arrays!$N$3:$N$13,'Data Entry Worksheet'!#REF!,Arrays!$O$3:$O$13,LEFT(K79,1)))>0),\"0\"&TEXT(K79,\"#\"),\"\")))))","v":""},{"$f":"IF(L79=\"\",\"\",IF(ISNA(MATCH(L79,Arrays!$G$3:$G$58,0)),IF(ISNA(MATCH(L79,Arrays!$H$3:$H$58,0)),\"NC\",\"CV\"),IF(EXACT(UPPER(L79),L79),\"C\",\"CV\")))","v":""},{"$f":"IF(AP79=\"CV\",IF(ISNA(MATCH(L79,Arrays!$G$3:$G$58,0)),INDEX(Arrays!$G$3:$H$58,MATCH(L79,Arrays!$H$3:$H$58,0),1),UPPER(L79)),\"\")","v":""},"","","","","",{"$f":"IF(O79=\"\",\"\",IF(ISNA(MATCH(O79,Arrays!$G$60:$G$65,0)),\"NC\",IF(EXACT(UPPER(O79),O79),\"C\",\"CV\")))","v":""},""]
["","","",null,null,null,null,null,null,null,null,null,null,null,null,"","","",null,"","","",{"$f":"IF(E80<>\"\",LEN(SUM(MID(0&E80,LARGE(ISNUMBER(--MID(E80,ROW(INDIRECT(\"1:\"&LEN(E80))),1))* ROW(INDIRECT(\"1:\"&LEN(E80))),ROW(INDIRECT(\"1:\"&LEN(E80))))+1,1)*10^ROW(INDIRECT(\"1:\"&LEN(E80)))/10)),\"\")","v":""},"","","","","","","","","","","","",{"$f":"IF(J80=\"\",\"\",IF(ISNA(MATCH(J80,Arrays!$G$3:$G$58,0)),IF(ISNA(MATCH(J80,Arrays!$H$3:$H$58,0)),\"NC\",\"CV\"),IF(EXACT(UPPER(J80),J80),\"C\",\"CV\")))","v":""},{"$f":"IF(AJ80=\"CV\",IF(ISNA(MATCH(J80,Arrays!$G$3:$G$58,0)),INDEX(Arrays!$G$3:$H$58,MATCH(J80,Arrays!$H$3:$H$58,0),1),UPPER(J80)),\"\")","v":""},{"$f":"IF(K80=\"\",\"\",LEN(SUM(MID(0&K80,LARGE(ISNUMBER(--MID(K80,ROW(INDIRECT(\"1:\"&LEN(K80))),1))* ROW(INDIRECT(\"1:\"&LEN(K80))),ROW(INDIRECT(\"1:\"&LEN(K80))))+1,1)*10^ROW(INDIRECT(\"1:\"&LEN(K80)))/10)))","v":""},"","",{"$f":"IF(AN80<>\"CV\",IF(AM80=\"CV\",LEFT(K80,5)&\"-\"&RIGHT(K80,4),\"\"),IF(LEN(K80)=5,TEXT(K80,\"#\"),IF(AN80=\"CV\",LEFT(K80,5)&\"-\"&RIGHT(K80,4),IF(AND(LEN(K80)=3,(COUNTIFS(Arrays!$I$3:$I$7,'Data Entry Worksheet'!#REF!,Arrays!$K$3:$K$7,LEFT(K80,1))+COUNTIFS(Arrays!$J$3:$J$7,'Data Entry Worksheet'!#REF!,Arrays!$K$3:$K$7,LEFT(K80,1)))>0),\"00\"&TEXT(K80,\"#\"),IF(AND(LEN(K80)=4,(COUNTIFS(Arrays!$M$3:$M$13,'Data Entry Worksheet'!#REF!,Arrays!$O$3:$O$13,LEFT(K80,1))+COUNTIFS(Arrays!$N$3:$N$13,'Data Entry Worksheet'!#REF!,Arrays!$O$3:$O$13,LEFT(K80,1)))>0),\"0\"&TEXT(K80,\"#\"),\"\")))))","v":""},{"$f":"IF(L80=\"\",\"\",IF(ISNA(MATCH(L80,Arrays!$G$3:$G$58,0)),IF(ISNA(MATCH(L80,Arrays!$H$3:$H$58,0)),\"NC\",\"CV\"),IF(EXACT(UPPER(L80),L80),\"C\",\"CV\")))","v":""},{"$f":"IF(AP80=\"CV\",IF(ISNA(MATCH(L80,Arrays!$G$3:$G$58,0)),INDEX(Arrays!$G$3:$H$58,MATCH(L80,Arrays!$H$3:$H$58,0),1),UPPER(L80)),\"\")","v":""},"","","","","",{"$f":"IF(O80=\"\",\"\",IF(ISNA(MATCH(O80,Arrays!$G$60:$G$65,0)),\"NC\",IF(EXACT(UPPER(O80),O80),\"C\",\"CV\")))","v":""},""]
["","","",null,null,null,null,null,null,null,null,null,null,null,null,"","","",null,"","","",{"$f":"IF(E81<>\"\",LEN(SUM(MID(0&E81,LARGE(ISNUMBER(--MID(E81,ROW(INDIRECT(\"1:\"&LEN(E81))),1))* ROW(INDIRECT(\"1:\"&LEN(E81))),ROW(INDIRECT(\"1:\"&LEN(E81))))+1,1)*10^ROW(INDIRECT(\"1:\"&LEN(E81)))/10)),\"\")","v":""},"","","","","","","","","","","","",{"$f":"IF(J81=\"\",\"\",IF(ISNA(MATCH(J81,Arrays!$G$3:$G$58,0)),IF(ISNA(MATCH(J81,Arrays!$H$3:$H$58,0)),\"NC\",\"CV\"),IF(EXACT(UPPER(J81),J81),\"C\",\"CV\")))","v":""},{"$f":"IF(AJ81=\"CV\",IF(ISNA(MATCH(J81,Arrays!$G$3:$G$58,0)),INDEX(Arrays!$G$3:$H$58,MATCH(J81,Arrays!$H$3:$H$58,0),1),UPPER(J81)),\"\")","v":""},{"$f":"IF(K81=\"\",\"\",LEN(SUM(MID(0&K81,LARGE(ISNUMBER(--MID(K81,ROW(INDIRECT(\"1:\"&LEN(K81))),1))* ROW(INDIRECT(\"1:\"&LEN(K81))),ROW(INDIRECT(\"1:\"&LEN(K81))))+1,1)*10^ROW(INDIRECT(\"1:\"&LEN(K81)))/10)))","v":""},"","",{"$f":"IF(AN81<>\"CV\",IF(AM81=\"CV\",LEFT(K81,5)&\"-\"&RIGHT(K81,4),\"\"),IF(LEN(K81)=5,TEXT(K81,\"#\"),IF(AN81=\"CV\",LEFT(K81,5)&\"-\"&RIGHT(K81,4),IF(AND(LEN(K81)=3,(COUNTIFS(Arrays!$I$3:$I$7,'Data Entry Worksheet'!#REF!,Arrays!$K$3:$K$7,LEFT(K81,1))+COUNTIFS(Arrays!$J$3:$J$7,'Data Entry Worksheet'!#REF!,Arrays!$K$3:$K$7,LEFT(K81,1)))>0),\"00\"&TEXT(K81,\"#\"),IF(AND(LEN(K81)=4,(COUNTIFS(Arrays!$M$3:$M$13,'Data Entry Worksheet'!#REF!,Arrays!$O$3:$O$13,LEFT(K81,1))+COUNTIFS(Arrays!$N$3:$N$13,'Data Entry Worksheet'!#REF!,Arrays!$O$3:$O$13,LEFT(K81,1)))>0),\"0\"&TEXT(K81,\"#\"),\"\")))))","v":""},{"$f":"IF(L81=\"\",\"\",IF(ISNA(MATCH(L81,Arrays!$G$3:$G$58,0)),IF(ISNA(MATCH(L81,Arrays!$H$3:$H$58,0)),\"NC\",\"CV\"),IF(EXACT(UPPER(L81),L81),\"C\",\"CV\")))","v":""},{"$f":"IF(AP81=\"CV\",IF(ISNA(MATCH(L81,Arrays!$G$3:$G$58,0)),INDEX(Arrays!$G$3:$H$58,MATCH(L81,Arrays!$H$3:$H$58,0),1),UPPER(L81)),\"\")","v":""},"","","","","",{"$f":"IF(O81=\"\",\"\",IF(ISNA(MATCH(O81,Arrays!$G$60:$G$65,0)),\"NC\",IF(EXACT(UPPER(O81),O81),\"C\",\"CV\")))","v":""},""]
["","","",null,null,null,null,null,null,null,null,null,null,null,null,{"$f":"IF(ISNA(MATCH(MAX(A:A),A:A,0)),\"\",IF(COUNTIF(D82:O82,\"\")=12,IF(ROW()<MATCH(MAX(A:A),A:A,0),\"Blank\",\"\"),IF(COUNTA(D82:G82)+COUNTA(I82:O82)=11,\"Complete\",\"Incomplete\")))","v":""},{"$f":"IF(COUNTIF(D82:O82,\"\")<>12,IF(COUNTIF(E:E,E82)=1,\"Unique\",IF(E82=\"\",\"No TIN Entered\",\"Duplicate\")),\"\")","v":""},"",null,"","","",{"$f":"IF(E82<>\"\",LEN(SUM(MID(0&E82,LARGE(ISNUMBER(--MID(E82,ROW(INDIRECT(\"1:\"&LEN(E82))),1))* ROW(INDIRECT(\"1:\"&LEN(E82))),ROW(INDIRECT(\"1:\"&LEN(E82))))+1,1)*10^ROW(INDIRECT(\"1:\"&LEN(E82)))/10)),\"\")","v":""},"","","","","","","","","","","","",{"$f":"IF(J82=\"\",\"\",IF(ISNA(MATCH(J82,Arrays!$G$3:$G$58,0)),IF(ISNA(MATCH(J82,Arrays!$H$3:$H$58,0)),\"NC\",\"CV\"),IF(EXACT(UPPER(J82),J82),\"C\",\"CV\")))","v":""},{"$f":"IF(AJ82=\"CV\",IF(ISNA(MATCH(J82,Arrays!$G$3:$G$58,0)),INDEX(Arrays!$G$3:$H$58,MATCH(J82,Arrays!$H$3:$H$58,0),1),UPPER(J82)),\"\")","v":""},{"$f":"IF(K82=\"\",\"\",LEN(SUM(MID(0&K82,LARGE(ISNUMBER(--MID(K82,ROW(INDIRECT(\"1:\"&LEN(K82))),1))* ROW(INDIRECT(\"1:\"&LEN(K82))),ROW(INDIRECT(\"1:\"&LEN(K82))))+1,1)*10^ROW(INDIRECT(\"1:\"&LEN(K82)))/10)))","v":""},"","",{"$f":"IF(AN82<>\"CV\",IF(AM82=\"CV\",LEFT(K82,5)&\"-\"&RIGHT(K82,4),\"\"),IF(LEN(K82)=5,TEXT(K82,\"#\"),IF(AN82=\"CV\",LEFT(K82,5)&\"-\"&RIGHT(K82,4),IF(AND(LEN(K82)=3,(COUNTIFS(Arrays!$I$3:$I$7,'Data Entry Worksheet'!#REF!,Arrays!$K$3:$K$7,LEFT(K82,1))+COUNTIFS(Arrays!$J$3:$J$7,'Data Entry Worksheet'!#REF!,Arrays!$K$3:$K$7,LEFT(K82,1)))>0),\"00\"&TEXT(K82,\"#\"),IF(AND(LEN(K82)=4,(COUNTIFS(Arrays!$M$3:$M$13,'Data Entry Worksheet'!#REF!,Arrays!$O$3:$O$13,LEFT(K82,1))+COUNTIFS(Arrays!$N$3:$N$13,'Data Entry Worksheet'!#REF!,Arrays!$O$3:$O$13,LEFT(K82,1)))>0),\"0\"&TEXT(K82,\"#\"),\"\")))))","v":""},{"$f":"IF(L82=\"\",\"\",IF(ISNA(MATCH(L82,Arrays!$G$3:$G$58,0)),IF(ISNA(MATCH(L82,Arrays!$H$3:$H$58,0)),\"NC\",\"CV\"),IF(EXACT(UPPER(L82),L82),\"C\",\"CV\")))","v":""},{"$f":"IF(AP82=\"CV\",IF(ISNA(MATCH(L82,Arrays!$G$3:$G$58,0)),INDEX(Arrays!$G$3:$H$58,MATCH(L82,Arrays!$H$3:$H$58,0),1),UPPER(L82)),\"\")","v":""},"","","","","",{"$f":"IF(O82=\"\",\"\",IF(ISNA(MATCH(O82,Arrays!$G$60:$G$65,0)),\"NC\",IF(EXACT(UPPER(O82),O82),\"C\",\"CV\")))","v":""},""]
["","","",null,null,null,null,null,null,null,null,null,null,null,null,"","","",null,"","","",{"$f":"IF(E83<>\"\",LEN(SUM(MID(0&E83,LARGE(ISNUMBER(--MID(E83,ROW(INDIRECT(\"1:\"&LEN(E83))),1))* ROW(INDIRECT(\"1:\"&LEN(E83))),ROW(INDIRECT(\"1:\"&LEN(E83))))+1,1)*10^ROW(INDIRECT(\"1:\"&LEN(E83)))/10)),\"\")","v":""},{"$f":"IF(E83=\"\",\"\",IF(OR(AND(W83=9,LEN(E83)=10,MID(E83,3,1)=\"-\"),AND(W83=8,LEFT(E83,1)=\"0\",LEN(E83)=10,MID(E83,3,1)=\"-\")),\"C\",IF(OR(AND(W83=9,LEN(E83)=9),AND(W83=8,LEFT(E83,1)=\"0\",LEN(E83)=9)),\"CV\",\"NC\")))","v":""},"","","","","","","","","","","",{"$f":"IF(J83=\"\",\"\",IF(ISNA(MATCH(J83,Arrays!$G$3:$G$58,0)),IF(ISNA(MATCH(J83,Arrays!$H$3:$H$58,0)),\"NC\",\"CV\"),IF(EXACT(UPPER(J83),J83),\"C\",\"CV\")))","v":""},{"$f":"IF(AJ83=\"CV\",IF(ISNA(MATCH(J83,Arrays!$G$3:$G$58,0)),INDEX(Arrays!$G$3:$H$58,MATCH(J83,Arrays!$H$3:$H$58,0),1),UPPER(J83)),\"\")","v":""},{"$f":"IF(K83=\"\",\"\",LEN(SUM(MID(0&K83,LARGE(ISNUMBER(--MID(K83,ROW(INDIRECT(\"1:\"&LEN(K83))),1))* ROW(INDIRECT(\"1:\"&LEN(K83))),ROW(INDIRECT(\"1:\"&LEN(K83))))+1,1)*10^ROW(INDIRECT(\"1:\"&LEN(K83)))/10)))","v":""},"","",{"$f":"IF(AN83<>\"CV\",IF(AM83=\"CV\",LEFT(K83,5)&\"-\"&RIGHT(K83,4),\"\"),IF(LEN(K83)=5,TEXT(K83,\"#\"),IF(AN83=\"CV\",LEFT(K83,5)&\"-\"&RIGHT(K83,4),IF(AND(LEN(K83)=3,(COUNTIFS(Arrays!$I$3:$I$7,'Data Entry Worksheet'!#REF!,Arrays!$K$3:$K$7,LEFT(K83,1))+COUNTIFS(Arrays!$J$3:$J$7,'Data Entry Worksheet'!#REF!,Arrays!$K$3:$K$7,LEFT(K83,1)))>0),\"00\"&TEXT(K83,\"#\"),IF(AND(LEN(K83)=4,(COUNTIFS(Arrays!$M$3:$M$13,'Data Entry Worksheet'!#REF!,Arrays!$O$3:$O$13,LEFT(K83,1))+COUNTIFS(Arrays!$N$3:$N$13,'Data Entry Worksheet'!#REF!,Arrays!$O$3:$O$13,LEFT(K83,1)))>0),\"0\"&TEXT(K83,\"#\"),\"\")))))","v":""},{"$f":"IF(L83=\"\",\"\",IF(ISNA(MATCH(L83,Arrays!$G$3:$G$58,0)),IF(ISNA(MATCH(L83,Arrays!$H$3:$H$58,0)),\"NC\",\"CV\"),IF(EXACT(UPPER(L83),L83),\"C\",\"CV\")))","v":""},{"$f":"IF(AP83=\"CV\",IF(ISNA(MATCH(L83,Arrays!$G$3:$G$58,0)),INDEX(Arrays!$G$3:$H$58,MATCH(L83,Arrays!$H$3:$H$58,0),1),UPPER(L83)),\"\")","v":""},"","","","","",{"$f":"IF(O83=\"\",\"\",IF(ISNA(MATCH(O83,Arrays!$G$60:$G$65,0)),\"NC\",IF(EXACT(UPPER(O83),O83),\"C\",\"CV\")))","v":""},""]
["","","",null,null,null,null,null,null,null,null,null,null,null,null,"","","",null,"","","",{"$f":"IF(E84<>\"\",LEN(SUM(MID(0&E84,LARGE(ISNUMBER(--MID(E84,ROW(INDIRECT(\"1:\"&LEN(E84))),1))* ROW(INDIRECT(\"1:\"&LEN(E84))),ROW(INDIRECT(\"1:\"&LEN(E84))))+1,1)*10^ROW(INDIRECT(\"1:\"&LEN(E84)))/10)),\"\")","v":""},"","","","","","","","","","","","",{"$f":"IF(J84=\"\",\"\",IF(ISNA(MATCH(J84,Arrays!$G$3:$G$58,0)),IF(ISNA(MATCH(J84,Arrays!$H$3:$H$58,0)),\"NC\",\"CV\"),IF(EXACT(UPPER(J84),J84),\"C\",\"CV\")))","v":""},{"$f":"IF(AJ84=\"CV\",IF(ISNA(MATCH(J84,Arrays!$G$3:$G$58,0)),INDEX(Arrays!$G$3:$H$58,MATCH(J84,Arrays!$H$3:$H$58,0),1),UPPER(J84)),\"\")","v":""},{"$f":"IF(K84=\"\",\"\",LEN(SUM(MID(0&K84,LARGE(ISNUMBER(--MID(K84,ROW(INDIRECT(\"1:\"&LEN(K84))),1))* ROW(INDIRECT(\"1:\"&LEN(K84))),ROW(INDIRECT(\"1:\"&LEN(K84))))+1,1)*10^ROW(INDIRECT(\"1:\"&LEN(K84)))/10)))","v":""},"","",{"$f":"IF(AN84<>\"CV\",IF(AM84=\"CV\",LEFT(K84,5)&\"-\"&RIGHT(K84,4),\"\"),IF(LEN(K84)=5,TEXT(K84,\"#\"),IF(AN84=\"CV\",LEFT(K84,5)&\"-\"&RIGHT(K84,4),IF(AND(LEN(K84)=3,(COUNTIFS(Arrays!$I$3:$I$7,'Data Entry Worksheet'!#REF!,Arrays!$K$3:$K$7,LEFT(K84,1))+COUNTIFS(Arrays!$J$3:$J$7,'Data Entry Worksheet'!#REF!,Arrays!$K$3:$K$7,LEFT(K84,1)))>0),\"00\"&TEXT(K84,\"#\"),IF(AND(LEN(K84)=4,(COUNTIFS(Arrays!$M$3:$M$13,'Data Entry Worksheet'!#REF!,Arrays!$O$3:$O$13,LEFT(K84,1))+COUNTIFS(Arrays!$N$3:$N$13,'Data Entry Worksheet'!#REF!,Arrays!$O$3:$O$13,LEFT(K84,1)))>0),\"0\"&TEXT(K84,\"#\"),\"\")))))","v":""},{"$f":"IF(L84=\"\",\"\",IF(ISNA(MATCH(L84,Arrays!$G$3:$G$58,0)),IF(ISNA(MATCH(L84,Arrays!$H$3:$H$58,0)),\"NC\",\"CV\"),IF(EXACT(UPPER(L84),L84),\"C\",\"CV\")))","v":""},{"$f":"IF(AP84=\"CV\",IF(ISNA(MATCH(L84,Arrays!$G$3:$G$58,0)),INDEX(Arrays!$G$3:$H$58,MATCH(L84,Arrays!$H$3:$H$58,0),1),UPPER(L84)),\"\")","v":""},"","","","","",{"$f":"IF(O84=\"\",\"\",IF(ISNA(MATCH(O84,Arrays!$G$60:$G$65,0)),\"NC\",IF(EXACT(UPPER(O84),O84),\"C\",\"CV\")))","v":""},""]
["","","",null,null,null,null,null,null,null,null,null,null,null,null,"","","",null,"","","",{"$f":"IF(E85<>\"\",LEN(SUM(MID(0&E85,LARGE(ISNUMBER(--MID(E85,ROW(INDIRECT(\"1:\"&LEN(E85))),1))* ROW(INDIRECT(\"1:\"&LEN(E85))),ROW(INDIRECT(\"1:\"&LEN(E85))))+1,1)*10^ROW(INDIRECT(\"1:\"&LEN(E85)))/10)),\"\")","v":""},"","","","","","","","","","","","",{"$f":"IF(J85=\"\",\"\",IF(ISNA(MATCH(J85,Arrays!$G$3:$G$58,0)),IF(ISNA(MATCH(J85,Arrays!$H$3:$H$58,0)),\"NC\",\"CV\"),IF(EXACT(UPPER(J85),J85),\"C\",\"CV\")))","v":""},{"$f":"IF(AJ85=\"CV\",IF(ISNA(MATCH(J85,Arrays!$G$3:$G$58,0)),INDEX(Arrays!$G$3:$H$58,MATCH(J85,Arrays!$H$3:$H$58,0),1),UPPER(J85)),\"\")","v":""},{"$f":"IF(K85=\"\",\"\",LEN(SUM(MID(0&K85,LARGE(ISNUMBER(--MID(K85,ROW(INDIRECT(\"1:\"&LEN(K85))),1))* ROW(INDIRECT(\"1:\"&LEN(K85))),ROW(INDIRECT(\"1:\"&LEN(K85))))+1,1)*10^ROW(INDIRECT(\"1:\"&LEN(K85)))/10)))","v":""},"","",{"$f":"IF(AN85<>\"CV\",IF(AM85=\"CV\",LEFT(K85,5)&\"-\"&RIGHT(K85,4),\"\"),IF(LEN(K85)=5,TEXT(K85,\"#\"),IF(AN85=\"CV\",LEFT(K85,5)&\"-\"&RIGHT(K85,4),IF(AND(LEN(K85)=3,(COUNTIFS(Arrays!$I$3:$I$7,'Data Entry Worksheet'!#REF!,Arrays!$K$3:$K$7,LEFT(K85,1))+COUNTIFS(Arrays!$J$3:$J$7,'Data Entry Worksheet'!#REF!,Arrays!$K$3:$K$7,LEFT(K85,1)))>0),\"00\"&TEXT(K85,\"#\"),IF(AND(LEN(K85)=4,(COUNTIFS(Arrays!$M$3:$M$13,'Data Entry Worksheet'!#REF!,Arrays!$O$3:$O$13,LEFT(K85,1))+COUNTIFS(Arrays!$N$3:$N$13,'Data Entry Worksheet'!#REF!,Arrays!$O$3:$O$13,LEFT(K85,1)))>0),\"0\"&TEXT(K85,\"#\"),\"\")))))","v":""},{"$f":"IF(L85=\"\",\"\",IF(ISNA(MATCH(L85,Arrays!$G$3:$G$58,0)),IF(ISNA(MATCH(L85,Arrays!$H$3:$H$58,0)),\"NC\",\"CV\"),IF(EXACT(UPPER(L85),L85),\"C\",\"CV\")))","v":""},{"$f":"IF(AP85=\"CV\",IF(ISNA(MATCH(L85,Arrays!$G$3:$G$58,0)),INDEX(Arrays!$G$3:$H$58,MATCH(L85,Arrays!$H$3:$H$58,0),1),UPPER(L85)),\"\")","v":""},"","","","","",{"$f":"IF(O85=\"\",\"\",IF(ISNA(MATCH(O85,Arrays!$G$60:$G$65,0)),\"NC\",IF(EXACT(UPPER(O85),O85),\"C\",\"CV\")))","v":""},""]
["","","",null,null,null,null,null,null,null,null,null,null,null,null,"","","",null,"","","",{"$f":"IF(E86<>\"\",LEN(SUM(MID(0&E86,LARGE(ISNUMBER(--MID(E86,ROW(INDIRECT(\"1:\"&LEN(E86))),1))* ROW(INDIRECT(\"1:\"&LEN(E86))),ROW(INDIRECT(\"1:\"&LEN(E86))))+1,1)*10^ROW(INDIRECT(\"1:\"&LEN(E86)))/10)),\"\")","v":""},"","","","","","","","","","","","",{"$f":"IF(J86=\"\",\"\",IF(ISNA(MATCH(J86,Arrays!$G$3:$G$58,0)),IF(ISNA(MATCH(J86,Arrays!$H$3:$H$58,0)),\"NC\",\"CV\"),IF(EXACT(UPPER(J86),J86),\"C\",\"CV\")))","v":""},{"$f":"IF(AJ86=\"CV\",IF(ISNA(MATCH(J86,Arrays!$G$3:$G$58,0)),INDEX(Arrays!$G$3:$H$58,MATCH(J86,Arrays!$H$3:$H$58,0),1),UPPER(J86)),\"\")","v":""},{"$f":"IF(K86=\"\",\"\",LEN(SUM(MID(0&K86,LARGE(ISNUMBER(--MID(K86,ROW(INDIRECT(\"1:\"&LEN(K86))),1))* ROW(INDIRECT(\"1:\"&LEN(K86))),ROW(INDIRECT(\"1:\"&LEN(K86))))+1,1)*10^ROW(INDIRECT(\"1:\"&LEN(K86)))/10)))","v":""},"","",{"$f":"IF(AN86<>\"CV\",IF(AM86=\"CV\",LEFT(K86,5)&\"-\"&RIGHT(K86,4),\"\"),IF(LEN(K86)=5,TEXT(K86,\"#\"),IF(AN86=\"CV\",LEFT(K86,5)&\"-\"&RIGHT(K86,4),IF(AND(LEN(K86)=3,(COUNTIFS(Arrays!$I$3:$I$7,'Data Entry Worksheet'!#REF!,Arrays!$K$3:$K$7,LEFT(K86,1))+COUNTIFS(Arrays!$J$3:$J$7,'Data Entry Worksheet'!#REF!,Arrays!$K$3:$K$7,LEFT(K86,1)))>0),\"00\"&TEXT(K86,\"#\"),IF(AND(LEN(K86)=4,(COUNTIFS(Arrays!$M$3:$M$13,'Data Entry Worksheet'!#REF!,Arrays!$O$3:$O$13,LEFT(K86,1))+COUNTIFS(Arrays!$N$3:$N$13,'Data Entry Worksheet'!#REF!,Arrays!$O$3:$O$13,LEFT(K86,1)))>0),\"0\"&TEXT(K86,\"#\"),\"\")))))","v":""},{"$f":"IF(L86=\"\",\"\",IF(ISNA(MATCH(L86,Arrays!$G$3:$G$58,0)),IF(ISNA(MATCH(L86,Arrays!$H$3:$H$58,0)),\"NC\",\"CV\"),IF(EXACT(UPPER(L86),L86),\"C\",\"CV\")))","v":""},{"$f":"IF(AP86=\"CV\",IF(ISNA(MATCH(L86,Arrays!$G$3:$G$58,0)),INDEX(Arrays!$G$3:$H$58,MATCH(L86,Arrays!$H$3:$H$58,0),1),UPPER(L86)),\"\")","v":""},"","","","","",{"$f":"IF(O86=\"\",\"\",IF(ISNA(MATCH(O86,Arrays!$G$60:$G$65,0)),\"NC\",IF(EXACT(UPPER(O86),O86),\"C\",\"CV\")))","v":""},""]
["","","",null,null,null,null,null,null,null,null,null,null,null,null,"","","",null,"","","",{"$f":"IF(E87<>\"\",LEN(SUM(MID(0&E87,LARGE(ISNUMBER(--MID(E87,ROW(INDIRECT(\"1:\"&LEN(E87))),1))* ROW(INDIRECT(\"1:\"&LEN(E87))),ROW(INDIRECT(\"1:\"&LEN(E87))))+1,1)*10^ROW(INDIRECT(\"1:\"&LEN(E87)))/10)),\"\")","v":""},"","","","","","","","","","","","",{"$f":"IF(J87=\"\",\"\",IF(ISNA(MATCH(J87,Arrays!$G$3:$G$58,0)),IF(ISNA(MATCH(J87,Arrays!$H$3:$H$58,0)),\"NC\",\"CV\"),IF(EXACT(UPPER(J87),J87),\"C\",\"CV\")))","v":""},{"$f":"IF(AJ87=\"CV\",IF(ISNA(MATCH(J87,Arrays!$G$3:$G$58,0)),INDEX(Arrays!$G$3:$H$58,MATCH(J87,Arrays!$H$3:$H$58,0),1),UPPER(J87)),\"\")","v":""},{"$f":"IF(K87=\"\",\"\",LEN(SUM(MID(0&K87,LARGE(ISNUMBER(--MID(K87,ROW(INDIRECT(\"1:\"&LEN(K87))),1))* ROW(INDIRECT(\"1:\"&LEN(K87))),ROW(INDIRECT(\"1:\"&LEN(K87))))+1,1)*10^ROW(INDIRECT(\"1:\"&LEN(K87)))/10)))","v":""},"","",{"$f":"IF(AN87<>\"CV\",IF(AM87=\"CV\",LEFT(K87,5)&\"-\"&RIGHT(K87,4),\"\"),IF(LEN(K87)=5,TEXT(K87,\"#\"),IF(AN87=\"CV\",LEFT(K87,5)&\"-\"&RIGHT(K87,4),IF(AND(LEN(K87)=3,(COUNTIFS(Arrays!$I$3:$I$7,'Data Entry Worksheet'!#REF!,Arrays!$K$3:$K$7,LEFT(K87,1))+COUNTIFS(Arrays!$J$3:$J$7,'Data Entry Worksheet'!#REF!,Arrays!$K$3:$K$7,LEFT(K87,1)))>0),\"00\"&TEXT(K87,\"#\"),IF(AND(LEN(K87)=4,(COUNTIFS(Arrays!$M$3:$M$13,'Data Entry Worksheet'!#REF!,Arrays!$O$3:$O$13,LEFT(K87,1))+COUNTIFS(Arrays!$N$3:$N$13,'Data Entry Worksheet'!#REF!,Arrays!$O$3:$O$13,LEFT(K87,1)))>0),\"0\"&TEXT(K87,\"#\"),\"\")))))","v":""},{"$f":"IF(L87=\"\",\"\",IF(ISNA(MATCH(L87,Arrays!$G$3:$G$58,0)),IF(ISNA(MATCH(L87,Arrays!$H$3:$H$58,0)),\"NC\",\"CV\"),IF(EXACT(UPPER(L87),L87),\"C\",\"CV\")))","v":""},{"$f":"IF(AP87=\"CV\",IF(ISNA(MATCH(L87,Arrays!$G$3:$G$58,0)),INDEX(Arrays!$G$3:$H$58,MATCH(L87,Arrays!$H$3:$H$58,0),1),UPPER(L87)),\"\")","v":""},"","","","","",{"$f":"IF(O87=\"\",\"\",IF(ISNA(MATCH(O87,Arrays!$G$60:$G$65,0)),\"NC\",IF(EXACT(UPPER(O87),O87),\"C\",\"CV\")))","v":""},""]
["","","",null,null,null,null,null,null,null,null,null,null,null,null,"","","",null,"","","",{"$f":"IF(E88<>\"\",LEN(SUM(MID(0&E88,LARGE(ISNUMBER(--MID(E88,ROW(INDIRECT(\"1:\"&LEN(E88))),1))* ROW(INDIRECT(\"1:\"&LEN(E88))),ROW(INDIRECT(\"1:\"&LEN(E88))))+1,1)*10^ROW(INDIRECT(\"1:\"&LEN(E88)))/10)),\"\")","v":""},"","","","","","","","","","","","",{"$f":"IF(J88=\"\",\"\",IF(ISNA(MATCH(J88,Arrays!$G$3:$G$58,0)),IF(ISNA(MATCH(J88,Arrays!$H$3:$H$58,0)),\"NC\",\"CV\"),IF(EXACT(UPPER(J88),J88),\"C\",\"CV\")))","v":""},{"$f":"IF(AJ88=\"CV\",IF(ISNA(MATCH(J88,Arrays!$G$3:$G$58,0)),INDEX(Arrays!$G$3:$H$58,MATCH(J88,Arrays!$H$3:$H$58,0),1),UPPER(J88)),\"\")","v":""},{"$f":"IF(K88=\"\",\"\",LEN(SUM(MID(0&K88,LARGE(ISNUMBER(--MID(K88,ROW(INDIRECT(\"1:\"&LEN(K88))),1))* ROW(INDIRECT(\"1:\"&LEN(K88))),ROW(INDIRECT(\"1:\"&LEN(K88))))+1,1)*10^ROW(INDIRECT(\"1:\"&LEN(K88)))/10)))","v":""},"","",{"$f":"IF(AN88<>\"CV\",IF(AM88=\"CV\",LEFT(K88,5)&\"-\"&RIGHT(K88,4),\"\"),IF(LEN(K88)=5,TEXT(K88,\"#\"),IF(AN88=\"CV\",LEFT(K88,5)&\"-\"&RIGHT(K88,4),IF(AND(LEN(K88)=3,(COUNTIFS(Arrays!$I$3:$I$7,'Data Entry Worksheet'!#REF!,Arrays!$K$3:$K$7,LEFT(K88,1))+COUNTIFS(Arrays!$J$3:$J$7,'Data Entry Worksheet'!#REF!,Arrays!$K$3:$K$7,LEFT(K88,1)))>0),\"00\"&TEXT(K88,\"#\"),IF(AND(LEN(K88)=4,(COUNTIFS(Arrays!$M$3:$M$13,'Data Entry Worksheet'!#REF!,Arrays!$O$3:$O$13,LEFT(K88,1))+COUNTIFS(Arrays!$N$3:$N$13,'Data Entry Worksheet'!#REF!,Arrays!$O$3:$O$13,LEFT(K88,1)))>0),\"0\"&TEXT(K88,\"#\"),\"\")))))","v":""},{"$f":"IF(L88=\"\",\"\",IF(ISNA(MATCH(L88,Arrays!$G$3:$G$58,0)),IF(ISNA(MATCH(L88,Arrays!$H$3:$H$58,0)),\"NC\",\"CV\"),IF(EXACT(UPPER(L88),L88),\"C\",\"CV\")))","v":""},{"$f":"IF(AP88=\"CV\",IF(ISNA(MATCH(L88,Arrays!$G$3:$G$58,0)),INDEX(Arrays!$G$3:$H$58,MATCH(L88,Arrays!$H$3:$H$58,0),1),UPPER(L88)),\"\")","v":""},"","","","","",{"$f":"IF(O88=\"\",\"\",IF(ISNA(MATCH(O88,Arrays!$G$60:$G$65,0)),\"NC\",IF(EXACT(UPPER(O88),O88),\"C\",\"CV\")))","v":""},""]
["","","",null,null,null,null,null,null,null,null,null,null,null,null,"","","",null,"","","",{"$f":"IF(E89<>\"\",LEN(SUM(MID(0&E89,LARGE(ISNUMBER(--MID(E89,ROW(INDIRECT(\"1:\"&LEN(E89))),1))* ROW(INDIRECT(\"1:\"&LEN(E89))),ROW(INDIRECT(\"1:\"&LEN(E89))))+1,1)*10^ROW(INDIRECT(\"1:\"&LEN(E89)))/10)),\"\")","v":""},"","","","","","","","","","","","",{"$f":"IF(J89=\"\",\"\",IF(ISNA(MATCH(J89,Arrays!$G$3:$G$58,0)),IF(ISNA(MATCH(J89,Arrays!$H$3:$H$58,0)),\"NC\",\"CV\"),IF(EXACT(UPPER(J89),J89),\"C\",\"CV\")))","v":""},{"$f":"IF(AJ89=\"CV\",IF(ISNA(MATCH(J89,Arrays!$G$3:$G$58,0)),INDEX(Arrays!$G$3:$H$58,MATCH(J89,Arrays!$H$3:$H$58,0),1),UPPER(J89)),\"\")","v":""},{"$f":"IF(K89=\"\",\"\",LEN(SUM(MID(0&K89,LARGE(ISNUMBER(--MID(K89,ROW(INDIRECT(\"1:\"&LEN(K89))),1))* ROW(INDIRECT(\"1:\"&LEN(K89))),ROW(INDIRECT(\"1:\"&LEN(K89))))+1,1)*10^ROW(INDIRECT(\"1:\"&LEN(K89)))/10)))","v":""},"","",{"$f":"IF(AN89<>\"CV\",IF(AM89=\"CV\",LEFT(K89,5)&\"-\"&RIGHT(K89,4),\"\"),IF(LEN(K89)=5,TEXT(K89,\"#\"),IF(AN89=\"CV\",LEFT(K89,5)&\"-\"&RIGHT(K89,4),IF(AND(LEN(K89)=3,(COUNTIFS(Arrays!$I$3:$I$7,'Data Entry Worksheet'!#REF!,Arrays!$K$3:$K$7,LEFT(K89,1))+COUNTIFS(Arrays!$J$3:$J$7,'Data Entry Worksheet'!#REF!,Arrays!$K$3:$K$7,LEFT(K89,1)))>0),\"00\"&TEXT(K89,\"#\"),IF(AND(LEN(K89)=4,(COUNTIFS(Arrays!$M$3:$M$13,'Data Entry Worksheet'!#REF!,Arrays!$O$3:$O$13,LEFT(K89,1))+COUNTIFS(Arrays!$N$3:$N$13,'Data Entry Worksheet'!#REF!,Arrays!$O$3:$O$13,LEFT(K89,1)))>0),\"0\"&TEXT(K89,\"#\"),\"\")))))","v":""},{"$f":"IF(L89=\"\",\"\",IF(ISNA(MATCH(L89,Arrays!$G$3:$G$58,0)),IF(ISNA(MATCH(L89,Arrays!$H$3:$H$58,0)),\"NC\",\"CV\"),IF(EXACT(UPPER(L89),L89),\"C\",\"CV\")))","v":""},{"$f":"IF(AP89=\"CV\",IF(ISNA(MATCH(L89,Arrays!$G$3:$G$58,0)),INDEX(Arrays!$G$3:$H$58,MATCH(L89,Arrays!$H$3:$H$58,0),1),UPPER(L89)),\"\")","v":""},"","","","","",{"$f":"IF(O89=\"\",\"\",IF(ISNA(MATCH(O89,Arrays!$G$60:$G$65,0)),\"NC\",IF(EXACT(UPPER(O89),O89),\"C\",\"CV\")))","v":""},""]
["","","",null,null,null,null,null,null,null,null,null,null,null,null,"","","",null,"","","",{"$f":"IF(E90<>\"\",LEN(SUM(MID(0&E90,LARGE(ISNUMBER(--MID(E90,ROW(INDIRECT(\"1:\"&LEN(E90))),1))* ROW(INDIRECT(\"1:\"&LEN(E90))),ROW(INDIRECT(\"1:\"&LEN(E90))))+1,1)*10^ROW(INDIRECT(\"1:\"&LEN(E90)))/10)),\"\")","v":""},"","","","","","","","","","","","",{"$f":"IF(J90=\"\",\"\",IF(ISNA(MATCH(J90,Arrays!$G$3:$G$58,0)),IF(ISNA(MATCH(J90,Arrays!$H$3:$H$58,0)),\"NC\",\"CV\"),IF(EXACT(UPPER(J90),J90),\"C\",\"CV\")))","v":""},{"$f":"IF(AJ90=\"CV\",IF(ISNA(MATCH(J90,Arrays!$G$3:$G$58,0)),INDEX(Arrays!$G$3:$H$58,MATCH(J90,Arrays!$H$3:$H$58,0),1),UPPER(J90)),\"\")","v":""},{"$f":"IF(K90=\"\",\"\",LEN(SUM(MID(0&K90,LARGE(ISNUMBER(--MID(K90,ROW(INDIRECT(\"1:\"&LEN(K90))),1))* ROW(INDIRECT(\"1:\"&LEN(K90))),ROW(INDIRECT(\"1:\"&LEN(K90))))+1,1)*10^ROW(INDIRECT(\"1:\"&LEN(K90)))/10)))","v":""},"","",{"$f":"IF(AN90<>\"CV\",IF(AM90=\"CV\",LEFT(K90,5)&\"-\"&RIGHT(K90,4),\"\"),IF(LEN(K90)=5,TEXT(K90,\"#\"),IF(AN90=\"CV\",LEFT(K90,5)&\"-\"&RIGHT(K90,4),IF(AND(LEN(K90)=3,(COUNTIFS(Arrays!$I$3:$I$7,'Data Entry Worksheet'!#REF!,Arrays!$K$3:$K$7,LEFT(K90,1))+COUNTIFS(Arrays!$J$3:$J$7,'Data Entry Worksheet'!#REF!,Arrays!$K$3:$K$7,LEFT(K90,1)))>0),\"00\"&TEXT(K90,\"#\"),IF(AND(LEN(K90)=4,(COUNTIFS(Arrays!$M$3:$M$13,'Data Entry Worksheet'!#REF!,Arrays!$O$3:$O$13,LEFT(K90,1))+COUNTIFS(Arrays!$N$3:$N$13,'Data Entry Worksheet'!#REF!,Arrays!$O$3:$O$13,LEFT(K90,1)))>0),\"0\"&TEXT(K90,\"#\"),\"\")))))","v":""},{"$f":"IF(L90=\"\",\"\",IF(ISNA(MATCH(L90,Arrays!$G$3:$G$58,0)),IF(ISNA(MATCH(L90,Arrays!$H$3:$H$58,0)),\"NC\",\"CV\"),IF(EXACT(UPPER(L90),L90),\"C\",\"CV\")))","v":""},{"$f":"IF(AP90=\"CV\",IF(ISNA(MATCH(L90,Arrays!$G$3:$G$58,0)),INDEX(Arrays!$G$3:$H$58,MATCH(L90,Arrays!$H$3:$H$58,0),1),UPPER(L90)),\"\")","v":""},"","","","","",{"$f":"IF(O90=\"\",\"\",IF(ISNA(MATCH(O90,Arrays!$G$60:$G$65,0)),\"NC\",IF(EXACT(UPPER(O90),O90),\"C\",\"CV\")))","v":""},""]
["","","",null,null,null,null,null,null,null,null,null,null,null,null,"","","",null,"","","",{"$f":"IF(E91<>\"\",LEN(SUM(MID(0&E91,LARGE(ISNUMBER(--MID(E91,ROW(INDIRECT(\"1:\"&LEN(E91))),1))* ROW(INDIRECT(\"1:\"&LEN(E91))),ROW(INDIRECT(\"1:\"&LEN(E91))))+1,1)*10^ROW(INDIRECT(\"1:\"&LEN(E91)))/10)),\"\")","v":""},"","","","","","","","","","","","",{"$f":"IF(J91=\"\",\"\",IF(ISNA(MATCH(J91,Arrays!$G$3:$G$58,0)),IF(ISNA(MATCH(J91,Arrays!$H$3:$H$58,0)),\"NC\",\"CV\"),IF(EXACT(UPPER(J91),J91),\"C\",\"CV\")))","v":""},{"$f":"IF(AJ91=\"CV\",IF(ISNA(MATCH(J91,Arrays!$G$3:$G$58,0)),INDEX(Arrays!$G$3:$H$58,MATCH(J91,Arrays!$H$3:$H$58,0),1),UPPER(J91)),\"\")","v":""},{"$f":"IF(K91=\"\",\"\",LEN(SUM(MID(0&K91,LARGE(ISNUMBER(--MID(K91,ROW(INDIRECT(\"1:\"&LEN(K91))),1))* ROW(INDIRECT(\"1:\"&LEN(K91))),ROW(INDIRECT(\"1:\"&LEN(K91))))+1,1)*10^ROW(INDIRECT(\"1:\"&LEN(K91)))/10)))","v":""},"","",{"$f":"IF(AN91<>\"CV\",IF(AM91=\"CV\",LEFT(K91,5)&\"-\"&RIGHT(K91,4),\"\"),IF(LEN(K91)=5,TEXT(K91,\"#\"),IF(AN91=\"CV\",LEFT(K91,5)&\"-\"&RIGHT(K91,4),IF(AND(LEN(K91)=3,(COUNTIFS(Arrays!$I$3:$I$7,'Data Entry Worksheet'!#REF!,Arrays!$K$3:$K$7,LEFT(K91,1))+COUNTIFS(Arrays!$J$3:$J$7,'Data Entry Worksheet'!#REF!,Arrays!$K$3:$K$7,LEFT(K91,1)))>0),\"00\"&TEXT(K91,\"#\"),IF(AND(LEN(K91)=4,(COUNTIFS(Arrays!$M$3:$M$13,'Data Entry Worksheet'!#REF!,Arrays!$O$3:$O$13,LEFT(K91,1))+COUNTIFS(Arrays!$N$3:$N$13,'Data Entry Worksheet'!#REF!,Arrays!$O$3:$O$13,LEFT(K91,1)))>0),\"0\"&TEXT(K91,\"#\"),\"\")))))","v":""},{"$f":"IF(L91=\"\",\"\",IF(ISNA(MATCH(L91,Arrays!$G$3:$G$58,0)),IF(ISNA(MATCH(L91,Arrays!$H$3:$H$58,0)),\"NC\",\"CV\"),IF(EXACT(UPPER(L91),L91),\"C\",\"CV\")))","v":""},{"$f":"IF(AP91=\"CV\",IF(ISNA(MATCH(L91,Arrays!$G$3:$G$58,0)),INDEX(Arrays!$G$3:$H$58,MATCH(L91,Arrays!$H$3:$H$58,0),1),UPPER(L91)),\"\")","v":""},"","","","","",{"$f":"IF(O91=\"\",\"\",IF(ISNA(MATCH(O91,Arrays!$G$60:$G$65,0)),\"NC\",IF(EXACT(UPPER(O91),O91),\"C\",\"CV\")))","v":""},""]
[{"$f":"IF(COUNTIF(D92:O92,\"\")<>12,ROW()-17,IF(COUNT(INDIRECT(ADDRESS(ROW()+1,COLUMN(),4)&\":A50000\"))>0,ROW()-17,\"\"))","v":""},{"$f":"IF(A92<>\"\",D$3,\"\")","v":""},{"$f":"IF(B92<>\"\",D$5,\"\")","v":""},null,null,null,null,null,null,null,null,null,null,null,null,"","",{"$f":"IF(COUNTIF(T92:AX92,\"NC\")>0,\"Error\"&IF(COUNTIF(T92:AX92,\"CV\")>0,\"/Format\",\"\"),IF(COUNTIF(T92:AX92,\"CV\")>0,\"Format\",\"\"))","v":""},null,{"$f":"IF(AND(ISERR(FIND(\"*\",D92)),ISERR(FIND(\"<\",D92)),ISERR(FIND(\">\",D92)),ISERR(FIND(\"\\\",D92)),ISERR(FIND(\"/\",D92)),ISERR(FIND(\"%\",D92)),ISERR(FIND(\"^\",D92)),ISERR(FIND(\"`\",D92)),ISERR(FIND(\"{\",D92)),ISERR(FIND(\"}\",D92)),ISERR(FIND(\"~\",D92)),ISERR(FIND(\"[\",D92)),ISERR(FIND(\"]\",D92)),ISERR(FIND(\"!\",D92)),ISERR(FIND(\"&\",D92)),ISERR(FIND(\"+\",D92)),ISERR(FIND(\"=\",D92)),ISERR(FIND(\"?\",D92)),ISERR(FIND(\"#\",D92)),ISERR(FIND(CHAR(34),D92))),\"\",\"CV\")","v":""},{"$f":"IF(T92=\"CV\",SUBSTITUTE(SUBSTITUTE(SUBSTITUTE(SUBSTITUTE(SUBSTITUTE(SUBSTITUTE(SUBSTITUTE(SUBSTITUTE(SUBSTITUTE(SUBSTITUTE(SUBSTITUTE(SUBSTITUTE(SUBSTITUTE(SUBSTITUTE(SUBSTITUTE(SUBSTITUTE(SUBSTITUTE(SUBSTITUTE(SUBSTITUTE(SUBSTITUTE(D92,\"*\",\"\"),\"<\",\"\"),\">\",\"\"),\"\\\",\"\"),\"/\",\"\"),\"%\",\"\"),\"^\",\"\"),\"`\",\"\"),\"{\",\"\"),\"}\",\"\"),\"~\",\"\"),\"[\",\"\"),\"]\",\"\"),\"!\",\"\"),\"&\",\"\"),\"+\",\"\"),\"=\",\"\"),\"?\",\"\"),\"#\",\"\"),CHAR(34),\"\"),\"\")","v":""},{"$f":"IF(LEN(D92)>150,\"NC\",\"\")","v":""},{"$f":"IF(E92<>\"\",LEN(SUM(MID(0&E92,LARGE(ISNUMBER(--MID(E92,ROW(INDIRECT(\"1:\"&LEN(E92))),1))* ROW(INDIRECT(\"1:\"&LEN(E92))),ROW(INDIRECT(\"1:\"&LEN(E92))))+1,1)*10^ROW(INDIRECT(\"1:\"&LEN(E92)))/10)),\"\")","v":""},"",{"$f":"IF(X92=\"CV\",LEFT(E92,2)&\"-\"&RIGHT(E92,7),\"\")","v":""},{"$f":"IF(F92=\"\",\"\",IF(F92=\"Nonprofit\",IF(EXACT(UPPER(LEFT(F92,1)),LEFT(F92,1)),\"C\",\"CV\"),IF(F92=\"For Profit\",IF(AND(EXACT(UPPER(LEFT(F92,1)),LEFT(F92,1)),EXACT(UPPER(MID(F92,5,1)),MID(F92,5,1))),\"C\",\"CV\"),\"NC\")))","v":""},{"$f":"IF(AND(ISERR(FIND(\"*\",G92)),ISERR(FIND(\"<\",G92)),ISERR(FIND(\">\",G92)),ISERR(FIND(\"\\\",G92)),ISERR(FIND(\"/\",G92)),ISERR(FIND(\"%\",G92)),ISERR(FIND(\"^\",G92)),ISERR(FIND(\"`\",G92)),ISERR(FIND(\"{\",G92)),ISERR(FIND(\"}\",G92)),ISERR(FIND(\"~\",G92)),ISERR(FIND(\"[\",G92)),ISERR(FIND(\"]\",G92)),ISERR(FIND(\"!\",G92)),ISERR(FIND(\"&\",G92)),ISERR(FIND(\"+\",G92)),ISERR(FIND(\"=\",G92)),ISERR(FIND(\"?\",G92)),ISERR(FIND(\"#\",G92)),ISERR(FIND(CHAR(34),G92))),\"\",\"CV\")","v":""},{"$f":"IF(AA92=\"CV\",SUBSTITUTE(SUBSTITUTE(SUBSTITUTE(SUBSTITUTE(SUBSTITUTE(SUBSTITUTE(SUBSTITUTE(SUBSTITUTE(SUBSTITUTE(SUBSTITUTE(SUBSTITUTE(SUBSTITUTE(SUBSTITUTE(SUBSTITUTE(SUBSTITUTE(SUBSTITUTE(SUBSTITUTE(SUBSTITUTE(SUBSTITUTE(SUBSTITUTE(G92,\"*\",\"\"),\"<\",\"\"),\">\",\"\"),\"\\\",\"\"),\"/\",\"\"),\"%\",\"\"),\"^\",\"\"),\"`\",\"\"),\"{\",\"\"),\"}\",\"\"),\"~\",\"\"),\"[\",\"\"),\"]\",\"\"),\"!\",\"\"),\"&\",\"\"),\"+\",\"\"),\"=\",\"\"),\"?\",\"\"),\"#\",\"\"),CHAR(34),\"\"),\"\")","v":""},{"$f":"IF(LEN(G92)>150,\"NC\",\"\")","v":""},{"$f":"IF(AND(ISERR(FIND(\"*\",H92)),ISERR(FIND(\"<\",H92)),ISERR(FIND(\">\",H92)),ISERR(FIND(\"\\\",H92)),ISERR(FIND(\"/\",H92)),ISERR(FIND(\"%\",H92)),ISERR(FIND(\"^\",H92)),ISERR(FIND(\"`\",H92)),ISERR(FIND(\"{\",H92)),ISERR(FIND(\"}\",H92)),ISERR(FIND(\"~\",H92)),ISERR(FIND(\"[\",H92)),ISERR(FIND(\"]\",H92)),ISERR(FIND(\"!\",H92)),ISERR(FIND(\"&\",H92)),ISERR(FIND(\"+\",H92)),ISERR(FIND(\"=\",H92)),ISERR(FIND(\"?\",H92)),ISERR(FIND(\"#\",H92)),ISERR(FIND(CHAR(34),H92))),\"\",\"CV\")","v":""},{"$f":"IF(AD92=\"CV\",SUBSTITUTE(SUBSTITUTE(SUBSTITUTE(SUBSTITUTE(SUBSTITUTE(SUBSTITUTE(SUBSTITUTE(SUBSTITUTE(SUBSTITUTE(SUBSTITUTE(SUBSTITUTE(SUBSTITUTE(SUBSTITUTE(SUBSTITUTE(SUBSTITUTE(SUBSTITUTE(SUBSTITUTE(SUBSTITUTE(SUBSTITUTE(SUBSTITUTE(H92,\"*\",\"\"),\"<\",\"\"),\">\",\"\"),\"\\\",\"\"),\"/\",\"\"),\"%\",\"\"),\"^\",\"\"),\"`\",\"\"),\"{\",\"\"),\"}\",\"\"),\"~\",\"\"),\"[\",\"\"),\"]\",\"\"),\"!\",\"\"),\"&\",\"\"),\"+\",\"\"),\"=\",\"\"),\"?\",\"\"),\"#\",\"\"),CHAR(34),\"\"),\"\")","v":""},{"$f":"IF(LEN(H92)>150,\"NC\",\"\")","v":""},{"$f":"IF(AND(ISERR(FIND(\"*\",I92)),ISERR(FIND(\"<\",I92)),ISERR(FIND(\">\",I92)),ISERR(FIND(\"\\\",I92)),ISERR(FIND(\"/\",I92)),ISERR(FIND(\"%\",I92)),ISERR(FIND(\"^\",I92)),ISERR(FIND(\"`\",I92)),ISERR(FIND(\"{\",I92)),ISERR(FIND(\"}\",I92)),ISERR(FIND(\"~\",I92)),ISERR(FIND(\"[\",I92)),ISERR(FIND(\"]\",I92)),ISERR(FIND(\"!\",I92)),ISERR(FIND(\"&\",I92)),ISERR(FIND(\"+\",I92)),ISERR(FIND(\"=\",I92)),ISERR(FIND(\"?\",I92)),ISERR(FIND(\"#\",I92)),ISERR(FIND(CHAR(34),I92))),\"\",\"CV\")","v":""},{"$f":"IF(AG92=\"CV\",SUBSTITUTE(SUBSTITUTE(SUBSTITUTE(SUBSTITUTE(SUBSTITUTE(SUBSTITUTE(SUBSTITUTE(SUBSTITUTE(SUBSTITUTE(SUBSTITUTE(SUBSTITUTE(SUBSTITUTE(SUBSTITUTE(SUBSTITUTE(SUBSTITUTE(SUBSTITUTE(SUBSTITUTE(SUBSTITUTE(SUBSTITUTE(SUBSTITUTE(I92,\"*\",\"\"),\"<\",\"\"),\">\",\"\"),\"\\\",\"\"),\"/\",\"\"),\"%\",\"\"),\"^\",\"\"),\"`\",\"\"),\"{\",\"\"),\"}\",\"\"),\"~\",\"\"),\"[\",\"\"),\"]\",\"\"),\"!\",\"\"),\"&\",\"\"),\"+\",\"\"),\"=\",\"\"),\"?\",\"\"),\"#\",\"\"),CHAR(34),\"\"),\"\")","v":""},{"$f":"IF(LEN(I92)>150,\"NC\",\"\")","v":""},{"$f":"IF(J92=\"\",\"\",IF(ISNA(MATCH(J92,Arrays!$G$3:$G$58,0)),IF(ISNA(MATCH(J92,Arrays!$H$3:$H$58,0)),\"NC\",\"CV\"),IF(EXACT(UPPER(J92),J92),\"C\",\"CV\")))","v":""},{"$f":"IF(AJ92=\"CV\",IF(ISNA(MATCH(J92,Arrays!$G$3:$G$58,0)),INDEX(Arrays!$G$3:$H$58,MATCH(J92,Arrays!$H$3:$H$58,0),1),UPPER(J92)),\"\")","v":""},{"$f":"IF(K92=\"\",\"\",LEN(SUM(MID(0&K92,LARGE(ISNUMBER(--MID(K92,ROW(INDIRECT(\"1:\"&LEN(K92))),1))* ROW(INDIRECT(\"1:\"&LEN(K92))),ROW(INDIRECT(\"1:\"&LEN(K92))))+1,1)*10^ROW(INDIRECT(\"1:\"&LEN(K92)))/10)))","v":""},{"$f":"IF(K92=\"\",\"\",IF(OR(AND(AL92=5,LEN(K92)=5),AND(AL92=9,LEN(K92)=10,MID(K92,6,1)=\"-\"),AND(AL92=4,LEN(K92)=5,LEFT(K92,1)=\"0\"),AND(AL92=8,LEN(K92)=10,MID(K92,6,1)=\"-\",LEFT(K92,1)=\"0\")),\"C\",IF(OR(AND(AL92=9,LEN(K92)=9),AND(AL92=8,LEN(K92)=9,LEFT(K92,1)=\"0\")),\"CV\",\"NC\")))","v":""},{"$f":"IF(K92=\"\",\"\",IF(ISTEXT(K92),\"\",TEXT(K92,\"##\")))","v":""},{"$f":"IF(AN92<>\"CV\",IF(AM92=\"CV\",LEFT(K92,5)&\"-\"&RIGHT(K92,4),\"\"),IF(LEN(K92)=5,TEXT(K92,\"#\"),IF(AN92=\"CV\",LEFT(K92,5)&\"-\"&RIGHT(K92,4),IF(AND(LEN(K92)=3,(COUNTIFS(Arrays!$I$3:$I$7,'Data Entry Worksheet'!#REF!,Arrays!$K$3:$K$7,LEFT(K92,1))+COUNTIFS(Arrays!$J$3:$J$7,'Data Entry Worksheet'!#REF!,Arrays!$K$3:$K$7,LEFT(K92,1)))>0),\"00\"&TEXT(K92,\"#\"),IF(AND(LEN(K92)=4,(COUNTIFS(Arrays!$M$3:$M$13,'Data Entry Worksheet'!#REF!,Arrays!$O$3:$O$13,LEFT(K92,1))+COUNTIFS(Arrays!$N$3:$N$13,'Data Entry Worksheet'!#REF!,Arrays!$O$3:$O$13,LEFT(K92,1)))>0),\"0\"&TEXT(K92,\"#\"),\"\")))))","v":""},{"$f":"IF(L92=\"\",\"\",IF(ISNA(MATCH(L92,Arrays!$G$3:$G$58,0)),IF(ISNA(MATCH(L92,Arrays!$H$3:$H$58,0)),\"NC\",\"CV\"),IF(EXACT(UPPER(L92),L92),\"C\",\"CV\")))","v":""},{"$f":"IF(AP92=\"CV\",IF(ISNA(MATCH(L92,Arrays!$G$3:$G$58,0)),INDEX(Arrays!$G$3:$H$58,MATCH(L92,Arrays!$H$3:$H$58,0),1),UPPER(L92)),\"\")","v":""},{"$f":"IF(M92=\"\",\"\",IF(ISERR(1*M92),\"NC\",IF(AND(1*M92<=YEAR(TODAY()),1*M92>2013),\"C\",\"NC\")))","v":""},{"$f":"IF(OR(F92=\"C\",F92=\"\"),\"\",IF(F92=\"nonprofit\",\"Nonprofit\",\"For Profit\"))","v":""},{"$f":"IF(AS92=\"CV\",TEXT(M92,\"##\"),\"\")","v":""},{"$f":"IF(N92=\"\",\"\",IF(ISERR(1*N92),\"NC\",IF(ISTEXT(N92),\"TX\",\"C\")))","v":""},{"$f":"IF(AU92=\"TX\",1*N92,\"\")","v":""},{"$f":"IF(O92=\"\",\"\",IF(ISNA(MATCH(O92,Arrays!$G$60:$G$65,0)),\"NC\",IF(EXACT(UPPER(O92),O92),\"C\",\"CV\")))","v":""},{"$f":"IF(AW92=\"\",\"\",UPPER(O92))","v":""}]
["","","",null,null,null,null,null,null,null,null,null,null,null,null,"","","",null,"","","",{"$f":"IF(E93<>\"\",LEN(SUM(MID(0&E93,LARGE(ISNUMBER(--MID(E93,ROW(INDIRECT(\"1:\"&LEN(E93))),1))* ROW(INDIRECT(\"1:\"&LEN(E93))),ROW(INDIRECT(\"1:\"&LEN(E93))))+1,1)*10^ROW(INDIRECT(\"1:\"&LEN(E93)))/10)),\"\")","v":""},"","","","","","","","","","","","",{"$f":"IF(J93=\"\",\"\",IF(ISNA(MATCH(J93,Arrays!$G$3:$G$58,0)),IF(ISNA(MATCH(J93,Arrays!$H$3:$H$58,0)),\"NC\",\"CV\"),IF(EXACT(UPPER(J93),J93),\"C\",\"CV\")))","v":""},{"$f":"IF(AJ93=\"CV\",IF(ISNA(MATCH(J93,Arrays!$G$3:$G$58,0)),INDEX(Arrays!$G$3:$H$58,MATCH(J93,Arrays!$H$3:$H$58,0),1),UPPER(J93)),\"\")","v":""},{"$f":"IF(K93=\"\",\"\",LEN(SUM(MID(0&K93,LARGE(ISNUMBER(--MID(K93,ROW(INDIRECT(\"1:\"&LEN(K93))),1))* ROW(INDIRECT(\"1:\"&LEN(K93))),ROW(INDIRECT(\"1:\"&LEN(K93))))+1,1)*10^ROW(INDIRECT(\"1:\"&LEN(K93)))/10)))","v":""},"","",{"$f":"IF(AN93<>\"CV\",IF(AM93=\"CV\",LEFT(K93,5)&\"-\"&RIGHT(K93,4),\"\"),IF(LEN(K93)=5,TEXT(K93,\"#\"),IF(AN93=\"CV\",LEFT(K93,5)&\"-\"&RIGHT(K93,4),IF(AND(LEN(K93)=3,(COUNTIFS(Arrays!$I$3:$I$7,'Data Entry Worksheet'!#REF!,Arrays!$K$3:$K$7,LEFT(K93,1))+COUNTIFS(Arrays!$J$3:$J$7,'Data Entry Worksheet'!#REF!,Arrays!$K$3:$K$7,LEFT(K93,1)))>0),\"00\"&TEXT(K93,\"#\"),IF(AND(LEN(K93)=4,(COUNTIFS(Arrays!$M$3:$M$13,'Data Entry Worksheet'!#REF!,Arrays!$O$3:$O$13,LEFT(K93,1))+COUNTIFS(Arrays!$N$3:$N$13,'Data Entry Worksheet'!#REF!,Arrays!$O$3:$O$13,LEFT(K93,1)))>0),\"0\"&TEXT(K93,\"#\"),\"\")))))","v":""},{"$f":"IF(L93=\"\",\"\",IF(ISNA(MATCH(L93,Arrays!$G$3:$G$58,0)),IF(ISNA(MATCH(L93,Arrays!$H$3:$H$58,0)),\"NC\",\"CV\"),IF(EXACT(UPPER(L93),L93),\"C\",\"CV\")))","v":""},{"$f":"IF(AP93=\"CV\",IF(ISNA(MATCH(L93,Arrays!$G$3:$G$58,0)),INDEX(Arrays!$G$3:$H$58,MATCH(L93,Arrays!$H$3:$H$58,0),1),UPPER(L93)),\"\")","v":""},"","","","","",{"$f":"IF(O93=\"\",\"\",IF(ISNA(MATCH(O93,Arrays!$G$60:$G$65,0)),\"NC\",IF(EXACT(UPPER(O93),O93),\"C\",\"CV\")))","v":""},""]
["","","",null,null,null,null,null,null,null,null,null,null,null,null,"","","",null,"","","",{"$f":"IF(E94<>\"\",LEN(SUM(MID(0&E94,LARGE(ISNUMBER(--MID(E94,ROW(INDIRECT(\"1:\"&LEN(E94))),1))* ROW(INDIRECT(\"1:\"&LEN(E94))),ROW(INDIRECT(\"1:\"&LEN(E94))))+1,1)*10^ROW(INDIRECT(\"1:\"&LEN(E94)))/10)),\"\")","v":""},"","","","","","","","","","","","",{"$f":"IF(J94=\"\",\"\",IF(ISNA(MATCH(J94,Arrays!$G$3:$G$58,0)),IF(ISNA(MATCH(J94,Arrays!$H$3:$H$58,0)),\"NC\",\"CV\"),IF(EXACT(UPPER(J94),J94),\"C\",\"CV\")))","v":""},{"$f":"IF(AJ94=\"CV\",IF(ISNA(MATCH(J94,Arrays!$G$3:$G$58,0)),INDEX(Arrays!$G$3:$H$58,MATCH(J94,Arrays!$H$3:$H$58,0),1),UPPER(J94)),\"\")","v":""},{"$f":"IF(K94=\"\",\"\",LEN(SUM(MID(0&K94,LARGE(ISNUMBER(--MID(K94,ROW(INDIRECT(\"1:\"&LEN(K94))),1))* ROW(INDIRECT(\"1:\"&LEN(K94))),ROW(INDIRECT(\"1:\"&LEN(K94))))+1,1)*10^ROW(INDIRECT(\"1:\"&LEN(K94)))/10)))","v":""},"","",{"$f":"IF(AN94<>\"CV\",IF(AM94=\"CV\",LEFT(K94,5)&\"-\"&RIGHT(K94,4),\"\"),IF(LEN(K94)=5,TEXT(K94,\"#\"),IF(AN94=\"CV\",LEFT(K94,5)&\"-\"&RIGHT(K94,4),IF(AND(LEN(K94)=3,(COUNTIFS(Arrays!$I$3:$I$7,'Data Entry Worksheet'!#REF!,Arrays!$K$3:$K$7,LEFT(K94,1))+COUNTIFS(Arrays!$J$3:$J$7,'Data Entry Worksheet'!#REF!,Arrays!$K$3:$K$7,LEFT(K94,1)))>0),\"00\"&TEXT(K94,\"#\"),IF(AND(LEN(K94)=4,(COUNTIFS(Arrays!$M$3:$M$13,'Data Entry Worksheet'!#REF!,Arrays!$O$3:$O$13,LEFT(K94,1))+COUNTIFS(Arrays!$N$3:$N$13,'Data Entry Worksheet'!#REF!,Arrays!$O$3:$O$13,LEFT(K94,1)))>0),\"0\"&TEXT(K94,\"#\"),\"\")))))","v":""},{"$f":"IF(L94=\"\",\"\",IF(ISNA(MATCH(L94,Arrays!$G$3:$G$58,0)),IF(ISNA(MATCH(L94,Arrays!$H$3:$H$58,0)),\"NC\",\"CV\"),IF(EXACT(UPPER(L94),L94),\"C\",\"CV\")))","v":""},{"$f":"IF(AP94=\"CV\",IF(ISNA(MATCH(L94,Arrays!$G$3:$G$58,0)),INDEX(Arrays!$G$3:$H$58,MATCH(L94,Arrays!$H$3:$H$58,0),1),UPPER(L94)),\"\")","v":""},"","","","","",{"$f":"IF(O94=\"\",\"\",IF(ISNA(MATCH(O94,Arrays!$G$60:$G$65,0)),\"NC\",IF(EXACT(UPPER(O94),O94),\"C\",\"CV\")))","v":""},""]
[{"$f":"IF(COUNTIF(D95:O95,\"\")<>12,ROW()-17,IF(COUNT(INDIRECT(ADDRESS(ROW()+1,COLUMN(),4)&\":A50000\"))>0,ROW()-17,\"\"))","v":""},{"$f":"IF(A95<>\"\",D$3,\"\")","v":""},{"$f":"IF(B95<>\"\",D$5,\"\")","v":""},null,null,null,null,null,null,null,null,null,null,null,null,"","",{"$f":"IF(COUNTIF(T95:AX95,\"NC\")>0,\"Error\"&IF(COUNTIF(T95:AX95,\"CV\")>0,\"/Format\",\"\"),IF(COUNTIF(T95:AX95,\"CV\")>0,\"Format\",\"\"))","v":""},null,{"$f":"IF(AND(ISERR(FIND(\"*\",D95)),ISERR(FIND(\"<\",D95)),ISERR(FIND(\">\",D95)),ISERR(FIND(\"\\\",D95)),ISERR(FIND(\"/\",D95)),ISERR(FIND(\"%\",D95)),ISERR(FIND(\"^\",D95)),ISERR(FIND(\"`\",D95)),ISERR(FIND(\"{\",D95)),ISERR(FIND(\"}\",D95)),ISERR(FIND(\"~\",D95)),ISERR(FIND(\"[\",D95)),ISERR(FIND(\"]\",D95)),ISERR(FIND(\"!\",D95)),ISERR(FIND(\"&\",D95)),ISERR(FIND(\"+\",D95)),ISERR(FIND(\"=\",D95)),ISERR(FIND(\"?\",D95)),ISERR(FIND(\"#\",D95)),ISERR(FIND(CHAR(34),D95))),\"\",\"CV\")","v":""},{"$f":"IF(T95=\"CV\",SUBSTITUTE(SUBSTITUTE(SUBSTITUTE(SUBSTITUTE(SUBSTITUTE(SUBSTITUTE(SUBSTITUTE(SUBSTITUTE(SUBSTITUTE(SUBSTITUTE(SUBSTITUTE(SUBSTITUTE(SUBSTITUTE(SUBSTITUTE(SUBSTITUTE(SUBSTITUTE(SUBSTITUTE(SUBSTITUTE(SUBSTITUTE(SUBSTITUTE(D95,\"*\",\"\"),\"<\",\"\"),\">\",\"\"),\"\\\",\"\"),\"/\",\"\"),\"%\",\"\"),\"^\",\"\"),\"`\",\"\"),\"{\",\"\"),\"}\",\"\"),\"~\",\"\"),\"[\",\"\"),\"]\",\"\"),\"!\",\"\"),\"&\",\"\"),\"+\",\"\"),\"=\",\"\"),\"?\",\"\"),\"#\",\"\"),CHAR(34),\"\"),\"\")","v":""},{"$f":"IF(LEN(D95)>150,\"NC\",\"\")","v":""},{"$f":"IF(E95<>\"\",LEN(SUM(MID(0&E95,LARGE(ISNUMBER(--MID(E95,ROW(INDIRECT(\"1:\"&LEN(E95))),1))* ROW(INDIRECT(\"1:\"&LEN(E95))),ROW(INDIRECT(\"1:\"&LEN(E95))))+1,1)*10^ROW(INDIRECT(\"1:\"&LEN(E95)))/10)),\"\")","v":""},"",{"$f":"IF(X95=\"CV\",LEFT(E95,2)&\"-\"&RIGHT(E95,7),\"\")","v":""},{"$f":"IF(F95=\"\",\"\",IF(F95=\"Nonprofit\",IF(EXACT(UPPER(LEFT(F95,1)),LEFT(F95,1)),\"C\",\"CV\"),IF(F95=\"For Profit\",IF(AND(EXACT(UPPER(LEFT(F95,1)),LEFT(F95,1)),EXACT(UPPER(MID(F95,5,1)),MID(F95,5,1))),\"C\",\"CV\"),\"NC\")))","v":""},{"$f":"IF(AND(ISERR(FIND(\"*\",G95)),ISERR(FIND(\"<\",G95)),ISERR(FIND(\">\",G95)),ISERR(FIND(\"\\\",G95)),ISERR(FIND(\"/\",G95)),ISERR(FIND(\"%\",G95)),ISERR(FIND(\"^\",G95)),ISERR(FIND(\"`\",G95)),ISERR(FIND(\"{\",G95)),ISERR(FIND(\"}\",G95)),ISERR(FIND(\"~\",G95)),ISERR(FIND(\"[\",G95)),ISERR(FIND(\"]\",G95)),ISERR(FIND(\"!\",G95)),ISERR(FIND(\"&\",G95)),ISERR(FIND(\"+\",G95)),ISERR(FIND(\"=\",G95)),ISERR(FIND(\"?\",G95)),ISERR(FIND(\"#\",G95)),ISERR(FIND(CHAR(34),G95))),\"\",\"CV\")","v":""},{"$f":"IF(AA95=\"CV\",SUBSTITUTE(SUBSTITUTE(SUBSTITUTE(SUBSTITUTE(SUBSTITUTE(SUBSTITUTE(SUBSTITUTE(SUBSTITUTE(SUBSTITUTE(SUBSTITUTE(SUBSTITUTE(SUBSTITUTE(SUBSTITUTE(SUBSTITUTE(SUBSTITUTE(SUBSTITUTE(SUBSTITUTE(SUBSTITUTE(SUBSTITUTE(SUBSTITUTE(G95,\"*\",\"\"),\"<\",\"\"),\">\",\"\"),\"\\\",\"\"),\"/\",\"\"),\"%\",\"\"),\"^\",\"\"),\"`\",\"\"),\"{\",\"\"),\"}\",\"\"),\"~\",\"\"),\"[\",\"\"),\"]\",\"\"),\"!\",\"\"),\"&\",\"\"),\"+\",\"\"),\"=\",\"\"),\"?\",\"\"),\"#\",\"\"),CHAR(34),\"\"),\"\")","v":""},{"$f":"IF(LEN(G95)>150,\"NC\",\"\")","v":""},{"$f":"IF(AND(ISERR(FIND(\"*\",H95)),ISERR(FIND(\"<\",H95)),ISERR(FIND(\">\",H95)),ISERR(FIND(\"\\\",H95)),ISERR(FIND(\"/\",H95)),ISERR(FIND(\"%\",H95)),ISERR(FIND(\"^\",H95)),ISERR(FIND(\"`\",H95)),ISERR(FIND(\"{\",H95)),ISERR(FIND(\"}\",H95)),ISERR(FIND(\"~\",H95)),ISERR(FIND(\"[\",H95)),ISERR(FIND(\"]\",H95)),ISERR(FIND(\"!\",H95)),ISERR(FIND(\"&\",H95)),ISERR(FIND(\"+\",H95)),ISERR(FIND(\"=\",H95)),ISERR(FIND(\"?\",H95)),ISERR(FIND(\"#\",H95)),ISERR(FIND(CHAR(34),H95))),\"\",\"CV\")","v":""},{"$f":"IF(AD95=\"CV\",SUBSTITUTE(SUBSTITUTE(SUBSTITUTE(SUBSTITUTE(SUBSTITUTE(SUBSTITUTE(SUBSTITUTE(SUBSTITUTE(SUBSTITUTE(SUBSTITUTE(SUBSTITUTE(SUBSTITUTE(SUBSTITUTE(SUBSTITUTE(SUBSTITUTE(SUBSTITUTE(SUBSTITUTE(SUBSTITUTE(SUBSTITUTE(SUBSTITUTE(H95,\"*\",\"\"),\"<\",\"\"),\">\",\"\"),\"\\\",\"\"),\"/\",\"\"),\"%\",\"\"),\"^\",\"\"),\"`\",\"\"),\"{\",\"\"),\"}\",\"\"),\"~\",\"\"),\"[\",\"\"),\"]\",\"\"),\"!\",\"\"),\"&\",\"\"),\"+\",\"\"),\"=\",\"\"),\"?\",\"\"),\"#\",\"\"),CHAR(34),\"\"),\"\")","v":""},{"$f":"IF(LEN(H95)>150,\"NC\",\"\")","v":""},{"$f":"IF(AND(ISERR(FIND(\"*\",I95)),ISERR(FIND(\"<\",I95)),ISERR(FIND(\">\",I95)),ISERR(FIND(\"\\\",I95)),ISERR(FIND(\"/\",I95)),ISERR(FIND(\"%\",I95)),ISERR(FIND(\"^\",I95)),ISERR(FIND(\"`\",I95)),ISERR(FIND(\"{\",I95)),ISERR(FIND(\"}\",I95)),ISERR(FIND(\"~\",I95)),ISERR(FIND(\"[\",I95)),ISERR(FIND(\"]\",I95)),ISERR(FIND(\"!\",I95)),ISERR(FIND(\"&\",I95)),ISERR(FIND(\"+\",I95)),ISERR(FIND(\"=\",I95)),ISERR(FIND(\"?\",I95)),ISERR(FIND(\"#\",I95)),ISERR(FIND(CHAR(34),I95))),\"\",\"CV\")","v":""},{"$f":"IF(AG95=\"CV\",SUBSTITUTE(SUBSTITUTE(SUBSTITUTE(SUBSTITUTE(SUBSTITUTE(SUBSTITUTE(SUBSTITUTE(SUBSTITUTE(SUBSTITUTE(SUBSTITUTE(SUBSTITUTE(SUBSTITUTE(SUBSTITUTE(SUBSTITUTE(SUBSTITUTE(SUBSTITUTE(SUBSTITUTE(SUBSTITUTE(SUBSTITUTE(SUBSTITUTE(I95,\"*\",\"\"),\"<\",\"\"),\">\",\"\"),\"\\\",\"\"),\"/\",\"\"),\"%\",\"\"),\"^\",\"\"),\"`\",\"\"),\"{\",\"\"),\"}\",\"\"),\"~\",\"\"),\"[\",\"\"),\"]\",\"\"),\"!\",\"\"),\"&\",\"\"),\"+\",\"\"),\"=\",\"\"),\"?\",\"\"),\"#\",\"\"),CHAR(34),\"\"),\"\")","v":""},{"$f":"IF(LEN(I95)>150,\"NC\",\"\")","v":""},{"$f":"IF(J95=\"\",\"\",IF(ISNA(MATCH(J95,Arrays!$G$3:$G$58,0)),IF(ISNA(MATCH(J95,Arrays!$H$3:$H$58,0)),\"NC\",\"CV\"),IF(EXACT(UPPER(J95),J95),\"C\",\"CV\")))","v":""},{"$f":"IF(AJ95=\"CV\",IF(ISNA(MATCH(J95,Arrays!$G$3:$G$58,0)),INDEX(Arrays!$G$3:$H$58,MATCH(J95,Arrays!$H$3:$H$58,0),1),UPPER(J95)),\"\")","v":""},{"$f":"IF(K95=\"\",\"\",LEN(SUM(MID(0&K95,LARGE(ISNUMBER(--MID(K95,ROW(INDIRECT(\"1:\"&LEN(K95))),1))* ROW(INDIRECT(\"1:\"&LEN(K95))),ROW(INDIRECT(\"1:\"&LEN(K95))))+1,1)*10^ROW(INDIRECT(\"1:\"&LEN(K95)))/10)))","v":""},{"$f":"IF(K95=\"\",\"\",IF(OR(AND(AL95=5,LEN(K95)=5),AND(AL95=9,LEN(K95)=10,MID(K95,6,1)=\"-\"),AND(AL95=4,LEN(K95)=5,LEFT(K95,1)=\"0\"),AND(AL95=8,LEN(K95)=10,MID(K95,6,1)=\"-\",LEFT(K95,1)=\"0\")),\"C\",IF(OR(AND(AL95=9,LEN(K95)=9),AND(AL95=8,LEN(K95)=9,LEFT(K95,1)=\"0\")),\"CV\",\"NC\")))","v":""},{"$f":"IF(K95=\"\",\"\",IF(ISTEXT(K95),\"\",TEXT(K95,\"##\")))","v":""},{"$f":"IF(AN95<>\"CV\",IF(AM95=\"CV\",LEFT(K95,5)&\"-\"&RIGHT(K95,4),\"\"),IF(LEN(K95)=5,TEXT(K95,\"#\"),IF(AN95=\"CV\",LEFT(K95,5)&\"-\"&RIGHT(K95,4),IF(AND(LEN(K95)=3,(COUNTIFS(Arrays!$I$3:$I$7,'Data Entry Worksheet'!#REF!,Arrays!$K$3:$K$7,LEFT(K95,1))+COUNTIFS(Arrays!$J$3:$J$7,'Data Entry Worksheet'!#REF!,Arrays!$K$3:$K$7,LEFT(K95,1)))>0),\"00\"&TEXT(K95,\"#\"),IF(AND(LEN(K95)=4,(COUNTIFS(Arrays!$M$3:$M$13,'Data Entry Worksheet'!#REF!,Arrays!$O$3:$O$13,LEFT(K95,1))+COUNTIFS(Arrays!$N$3:$N$13,'Data Entry Worksheet'!#REF!,Arrays!$O$3:$O$13,LEFT(K95,1)))>0),\"0\"&TEXT(K95,\"#\"),\"\")))))","v":""},{"$f":"IF(L95=\"\",\"\",IF(ISNA(MATCH(L95,Arrays!$G$3:$G$58,0)),IF(ISNA(MATCH(L95,Arrays!$H$3:$H$58,0)),\"NC\",\"CV\"),IF(EXACT(UPPER(L95),L95),\"C\",\"CV\")))","v":""},{"$f":"IF(AP95=\"CV\",IF(ISNA(MATCH(L95,Arrays!$G$3:$G$58,0)),INDEX(Arrays!$G$3:$H$58,MATCH(L95,Arrays!$H$3:$H$58,0),1),UPPER(L95)),\"\")","v":""},{"$f":"IF(M95=\"\",\"\",IF(ISERR(1*M95),\"NC\",IF(AND(1*M95<=YEAR(TODAY()),1*M95>2013),\"C\",\"NC\")))","v":""},{"$f":"IF(OR(F95=\"C\",F95=\"\"),\"\",IF(F95=\"nonprofit\",\"Nonprofit\",\"For Profit\"))","v":""},{"$f":"IF(AS95=\"CV\",TEXT(M95,\"##\"),\"\")","v":""},{"$f":"IF(N95=\"\",\"\",IF(ISERR(1*N95),\"NC\",IF(ISTEXT(N95),\"TX\",\"C\")))","v":""},{"$f":"IF(AU95=\"TX\",1*N95,\"\")","v":""},{"$f":"IF(O95=\"\",\"\",IF(ISNA(MATCH(O95,Arrays!$G$60:$G$65,0)),\"NC\",IF(EXACT(UPPER(O95),O95),\"C\",\"CV\")))","v":""},{"$f":"IF(AW95=\"\",\"\",UPPER(O95))","v":""}]
[{"$f":"IF(COUNTIF(D96:O96,\"\")<>12,ROW()-17,IF(COUNT(INDIRECT(ADDRESS(ROW()+1,COLUMN(),4)&\":A50000\"))>0,ROW()-17,\"\"))","v":""},{"$f":"IF(A96<>\"\",D$3,\"\")","v":""},{"$f":"IF(B96<>\"\",D$5,\"\")","v":""},null,null,null,null,null,null,null,null,null,null,null,null,"","",{"$f":"IF(COUNTIF(T96:AX96,\"NC\")>0,\"Error\"&IF(COUNTIF(T96:AX96,\"CV\")>0,\"/Format\",\"\"),IF(COUNTIF(T96:AX96,\"CV\")>0,\"Format\",\"\"))","v":""},null,{"$f":"IF(AND(ISERR(FIND(\"*\",D96)),ISERR(FIND(\"<\",D96)),ISERR(FIND(\">\",D96)),ISERR(FIND(\"\\\",D96)),ISERR(FIND(\"/\",D96)),ISERR(FIND(\"%\",D96)),ISERR(FIND(\"^\",D96)),ISERR(FIND(\"`\",D96)),ISERR(FIND(\"{\",D96)),ISERR(FIND(\"}\",D96)),ISERR(FIND(\"~\",D96)),ISERR(FIND(\"[\",D96)),ISERR(FIND(\"]\",D96)),ISERR(FIND(\"!\",D96)),ISERR(FIND(\"&\",D96)),ISERR(FIND(\"+\",D96)),ISERR(FIND(\"=\",D96)),ISERR(FIND(\"?\",D96)),ISERR(FIND(\"#\",D96)),ISERR(FIND(CHAR(34),D96))),\"\",\"CV\")","v":""},{"$f":"IF(T96=\"CV\",SUBSTITUTE(SUBSTITUTE(SUBSTITUTE(SUBSTITUTE(SUBSTITUTE(SUBSTITUTE(SUBSTITUTE(SUBSTITUTE(SUBSTITUTE(SUBSTITUTE(SUBSTITUTE(SUBSTITUTE(SUBSTITUTE(SUBSTITUTE(SUBSTITUTE(SUBSTITUTE(SUBSTITUTE(SUBSTITUTE(SUBSTITUTE(SUBSTITUTE(D96,\"*\",\"\"),\"<\",\"\"),\">\",\"\"),\"\\\",\"\"),\"/\",\"\"),\"%\",\"\"),\"^\",\"\"),\"`\",\"\"),\"{\",\"\"),\"}\",\"\"),\"~\",\"\"),\"[\",\"\"),\"]\",\"\"),\"!\",\"\"),\"&\",\"\"),\"+\",\"\"),\"=\",\"\"),\"?\",\"\"),\"#\",\"\"),CHAR(34),\"\"),\"\")","v":""},{"$f":"IF(LEN(D96)>150,\"NC\",\"\")","v":""},{"$f":"IF(E96<>\"\",LEN(SUM(MID(0&E96,LARGE(ISNUMBER(--MID(E96,ROW(INDIRECT(\"1:\"&LEN(E96))),1))* ROW(INDIRECT(\"1:\"&LEN(E96))),ROW(INDIRECT(\"1:\"&LEN(E96))))+1,1)*10^ROW(INDIRECT(\"1:\"&LEN(E96)))/10)),\"\")","v":""},"",{"$f":"IF(X96=\"CV\",LEFT(E96,2)&\"-\"&RIGHT(E96,7),\"\")","v":""},{"$f":"IF(F96=\"\",\"\",IF(F96=\"Nonprofit\",IF(EXACT(UPPER(LEFT(F96,1)),LEFT(F96,1)),\"C\",\"CV\"),IF(F96=\"For Profit\",IF(AND(EXACT(UPPER(LEFT(F96,1)),LEFT(F96,1)),EXACT(UPPER(MID(F96,5,1)),MID(F96,5,1))),\"C\",\"CV\"),\"NC\")))","v":""},{"$f":"IF(AND(ISERR(FIND(\"*\",G96)),ISERR(FIND(\"<\",G96)),ISERR(FIND(\">\",G96)),ISERR(FIND(\"\\\",G96)),ISERR(FIND(\"/\",G96)),ISERR(FIND(\"%\",G96)),ISERR(FIND(\"^\",G96)),ISERR(FIND(\"`\",G96)),ISERR(FIND(\"{\",G96)),ISERR(FIND(\"}\",G96)),ISERR(FIND(\"~\",G96)),ISERR(FIND(\"[\",G96)),ISERR(FIND(\"]\",G96)),ISERR(FIND(\"!\",G96)),ISERR(FIND(\"&\",G96)),ISERR(FIND(\"+\",G96)),ISERR(FIND(\"=\",G96)),ISERR(FIND(\"?\",G96)),ISERR(FIND(\"#\",G96)),ISERR(FIND(CHAR(34),G96))),\"\",\"CV\")","v":""},{"$f":"IF(AA96=\"CV\",SUBSTITUTE(SUBSTITUTE(SUBSTITUTE(SUBSTITUTE(SUBSTITUTE(SUBSTITUTE(SUBSTITUTE(SUBSTITUTE(SUBSTITUTE(SUBSTITUTE(SUBSTITUTE(SUBSTITUTE(SUBSTITUTE(SUBSTITUTE(SUBSTITUTE(SUBSTITUTE(SUBSTITUTE(SUBSTITUTE(SUBSTITUTE(SUBSTITUTE(G96,\"*\",\"\"),\"<\",\"\"),\">\",\"\"),\"\\\",\"\"),\"/\",\"\"),\"%\",\"\"),\"^\",\"\"),\"`\",\"\"),\"{\",\"\"),\"}\",\"\"),\"~\",\"\"),\"[\",\"\"),\"]\",\"\"),\"!\",\"\"),\"&\",\"\"),\"+\",\"\"),\"=\",\"\"),\"?\",\"\"),\"#\",\"\"),CHAR(34),\"\"),\"\")","v":""},{"$f":"IF(LEN(G96)>150,\"NC\",\"\")","v":""},{"$f":"IF(AND(ISERR(FIND(\"*\",H96)),ISERR(FIND(\"<\",H96)),ISERR(FIND(\">\",H96)),ISERR(FIND(\"\\\",H96)),ISERR(FIND(\"/\",H96)),ISERR(FIND(\"%\",H96)),ISERR(FIND(\"^\",H96)),ISERR(FIND(\"`\",H96)),ISERR(FIND(\"{\",H96)),ISERR(FIND(\"}\",H96)),ISERR(FIND(\"~\",H96)),ISERR(FIND(\"[\",H96)),ISERR(FIND(\"]\",H96)),ISERR(FIND(\"!\",H96)),ISERR(FIND(\"&\",H96)),ISERR(FIND(\"+\",H96)),ISERR(FIND(\"=\",H96)),ISERR(FIND(\"?\",H96)),ISERR(FIND(\"#\",H96)),ISERR(FIND(CHAR(34),H96))),\"\",\"CV\")","v":""},{"$f":"IF(AD96=\"CV\",SUBSTITUTE(SUBSTITUTE(SUBSTITUTE(SUBSTITUTE(SUBSTITUTE(SUBSTITUTE(SUBSTITUTE(SUBSTITUTE(SUBSTITUTE(SUBSTITUTE(SUBSTITUTE(SUBSTITUTE(SUBSTITUTE(SUBSTITUTE(SUBSTITUTE(SUBSTITUTE(SUBSTITUTE(SUBSTITUTE(SUBSTITUTE(SUBSTITUTE(H96,\"*\",\"\"),\"<\",\"\"),\">\",\"\"),\"\\\",\"\"),\"/\",\"\"),\"%\",\"\"),\"^\",\"\"),\"`\",\"\"),\"{\",\"\"),\"}\",\"\"),\"~\",\"\"),\"[\",\"\"),\"]\",\"\"),\"!\",\"\"),\"&\",\"\"),\"+\",\"\"),\"=\",\"\"),\"?\",\"\"),\"#\",\"\"),CHAR(34),\"\"),\"\")","v":""},{"$f":"IF(LEN(H96)>150,\"NC\",\"\")","v":""},{"$f":"IF(AND(ISERR(FIND(\"*\",I96)),ISERR(FIND(\"<\",I96)),ISERR(FIND(\">\",I96)),ISERR(FIND(\"\\\",I96)),ISERR(FIND(\"/\",I96)),ISERR(FIND(\"%\",I96)),ISERR(FIND(\"^\",I96)),ISERR(FIND(\"`\",I96)),ISERR(FIND(\"{\",I96)),ISERR(FIND(\"}\",I96)),ISERR(FIND(\"~\",I96)),ISERR(FIND(\"[\",I96)),ISERR(FIND(\"]\",I96)),ISERR(FIND(\"!\",I96)),ISERR(FIND(\"&\",I96)),ISERR(FIND(\"+\",I96)),ISERR(FIND(\"=\",I96)),ISERR(FIND(\"?\",I96)),ISERR(FIND(\"#\",I96)),ISERR(FIND(CHAR(34),I96))),\"\",\"CV\")","v":""},{"$f":"IF(AG96=\"CV\",SUBSTITUTE(SUBSTITUTE(SUBSTITUTE(SUBSTITUTE(SUBSTITUTE(SUBSTITUTE(SUBSTITUTE(SUBSTITUTE(SUBSTITUTE(SUBSTITUTE(SUBSTITUTE(SUBSTITUTE(SUBSTITUTE(SUBSTITUTE(SUBSTITUTE(SUBSTITUTE(SUBSTITUTE(SUBSTITUTE(SUBSTITUTE(SUBSTITUTE(I96,\"*\",\"\"),\"<\",\"\"),\">\",\"\"),\"\\\",\"\"),\"/\",\"\"),\"%\",\"\"),\"^\",\"\"),\"`\",\"\"),\"{\",\"\"),\"}\",\"\"),\"~\",\"\"),\"[\",\"\"),\"]\",\"\"),\"!\",\"\"),\"&\",\"\"),\"+\",\"\"),\"=\",\"\"),\"?\",\"\"),\"#\",\"\"),CHAR(34),\"\"),\"\")","v":""},{"$f":"IF(LEN(I96)>150,\"NC\",\"\")","v":""},{"$f":"IF(J96=\"\",\"\",IF(ISNA(MATCH(J96,Arrays!$G$3:$G$58,0)),IF(ISNA(MATCH(J96,Arrays!$H$3:$H$58,0)),\"NC\",\"CV\"),IF(EXACT(UPPER(J96),J96),\"C\",\"CV\")))","v":""},{"$f":"IF(AJ96=\"CV\",IF(ISNA(MATCH(J96,Arrays!$G$3:$G$58,0)),INDEX(Arrays!$G$3:$H$58,MATCH(J96,Arrays!$H$3:$H$58,0),1),UPPER(J96)),\"\")","v":""},{"$f":"IF(K96=\"\",\"\",LEN(SUM(MID(0&K96,LARGE(ISNUMBER(--MID(K96,ROW(INDIRECT(\"1:\"&LEN(K96))),1))* ROW(INDIRECT(\"1:\"&LEN(K96))),ROW(INDIRECT(\"1:\"&LEN(K96))))+1,1)*10^ROW(INDIRECT(\"1:\"&LEN(K96)))/10)))","v":""},{"$f":"IF(K96=\"\",\"\",IF(OR(AND(AL96=5,LEN(K96)=5),AND(AL96=9,LEN(K96)=10,MID(K96,6,1)=\"-\"),AND(AL96=4,LEN(K96)=5,LEFT(K96,1)=\"0\"),AND(AL96=8,LEN(K96)=10,MID(K96,6,1)=\"-\",LEFT(K96,1)=\"0\")),\"C\",IF(OR(AND(AL96=9,LEN(K96)=9),AND(AL96=8,LEN(K96)=9,LEFT(K96,1)=\"0\")),\"CV\",\"NC\")))","v":""},{"$f":"IF(K96=\"\",\"\",IF(ISTEXT(K96),\"\",TEXT(K96,\"##\")))","v":""},{"$f":"IF(AN96<>\"CV\",IF(AM96=\"CV\",LEFT(K96,5)&\"-\"&RIGHT(K96,4),\"\"),IF(LEN(K96)=5,TEXT(K96,\"#\"),IF(AN96=\"CV\",LEFT(K96,5)&\"-\"&RIGHT(K96,4),IF(AND(LEN(K96)=3,(COUNTIFS(Arrays!$I$3:$I$7,'Data Entry Worksheet'!#REF!,Arrays!$K$3:$K$7,LEFT(K96,1))+COUNTIFS(Arrays!$J$3:$J$7,'Data Entry Worksheet'!#REF!,Arrays!$K$3:$K$7,LEFT(K96,1)))>0),\"00\"&TEXT(K96,\"#\"),IF(AND(LEN(K96)=4,(COUNTIFS(Arrays!$M$3:$M$13,'Data Entry Worksheet'!#REF!,Arrays!$O$3:$O$13,LEFT(K96,1))+COUNTIFS(Arrays!$N$3:$N$13,'Data Entry Worksheet'!#REF!,Arrays!$O$3:$O$13,LEFT(K96,1)))>0),\"0\"&TEXT(K96,\"#\"),\"\")))))","v":""},{"$f":"IF(L96=\"\",\"\",IF(ISNA(MATCH(L96,Arrays!$G$3:$G$58,0)),IF(ISNA(MATCH(L96,Arrays!$H$3:$H$58,0)),\"NC\",\"CV\"),IF(EXACT(UPPER(L96),L96),\"C\",\"CV\")))","v":""},{"$f":"IF(AP96=\"CV\",IF(ISNA(MATCH(L96,Arrays!$G$3:$G$58,0)),INDEX(Arrays!$G$3:$H$58,MATCH(L96,Arrays!$H$3:$H$58,0),1),UPPER(L96)),\"\")","v":""},{"$f":"IF(M96=\"\",\"\",IF(ISERR(1*M96),\"NC\",IF(AND(1*M96<=YEAR(TODAY()),1*M96>2013),\"C\",\"NC\")))","v":""},{"$f":"IF(OR(F96=\"C\",F96=\"\"),\"\",IF(F96=\"nonprofit\",\"Nonprofit\",\"For Profit\"))","v":""},{"$f":"IF(AS96=\"CV\",TEXT(M96,\"##\"),\"\")","v":""},{"$f":"IF(N96=\"\",\"\",IF(ISERR(1*N96),\"NC\",IF(ISTEXT(N96),\"TX\",\"C\")))","v":""},{"$f":"IF(AU96=\"TX\",1*N96,\"\")","v":""},{"$f":"IF(O96=\"\",\"\",IF(ISNA(MATCH(O96,Arrays!$G$60:$G$65,0)),\"NC\",IF(EXACT(UPPER(O96),O96),\"C\",\"CV\")))","v":""},{"$f":"IF(AW96=\"\",\"\",UPPER(O96))","v":""}]
[{"$f":"IF(COUNTIF(D97:O97,\"\")<>12,ROW()-17,IF(COUNT(INDIRECT(ADDRESS(ROW()+1,COLUMN(),4)&\":A50000\"))>0,ROW()-17,\"\"))","v":""},{"$f":"IF(A97<>\"\",D$3,\"\")","v":""},{"$f":"IF(B97<>\"\",D$5,\"\")","v":""},null,null,null,null,null,null,null,null,null,null,null,null,"","",{"$f":"IF(COUNTIF(T97:AX97,\"NC\")>0,\"Error\"&IF(COUNTIF(T97:AX97,\"CV\")>0,\"/Format\",\"\"),IF(COUNTIF(T97:AX97,\"CV\")>0,\"Format\",\"\"))","v":""},null,{"$f":"IF(AND(ISERR(FIND(\"*\",D97)),ISERR(FIND(\"<\",D97)),ISERR(FIND(\">\",D97)),ISERR(FIND(\"\\\",D97)),ISERR(FIND(\"/\",D97)),ISERR(FIND(\"%\",D97)),ISERR(FIND(\"^\",D97)),ISERR(FIND(\"`\",D97)),ISERR(FIND(\"{\",D97)),ISERR(FIND(\"}\",D97)),ISERR(FIND(\"~\",D97)),ISERR(FIND(\"[\",D97)),ISERR(FIND(\"]\",D97)),ISERR(FIND(\"!\",D97)),ISERR(FIND(\"&\",D97)),ISERR(FIND(\"+\",D97)),ISERR(FIND(\"=\",D97)),ISERR(FIND(\"?\",D97)),ISERR(FIND(\"#\",D97)),ISERR(FIND(CHAR(34),D97))),\"\",\"CV\")","v":""},{"$f":"IF(T97=\"CV\",SUBSTITUTE(SUBSTITUTE(SUBSTITUTE(SUBSTITUTE(SUBSTITUTE(SUBSTITUTE(SUBSTITUTE(SUBSTITUTE(SUBSTITUTE(SUBSTITUTE(SUBSTITUTE(SUBSTITUTE(SUBSTITUTE(SUBSTITUTE(SUBSTITUTE(SUBSTITUTE(SUBSTITUTE(SUBSTITUTE(SUBSTITUTE(SUBSTITUTE(D97,\"*\",\"\"),\"<\",\"\"),\">\",\"\"),\"\\\",\"\"),\"/\",\"\"),\"%\",\"\"),\"^\",\"\"),\"`\",\"\"),\"{\",\"\"),\"}\",\"\"),\"~\",\"\"),\"[\",\"\"),\"]\",\"\"),\"!\",\"\"),\"&\",\"\"),\"+\",\"\"),\"=\",\"\"),\"?\",\"\"),\"#\",\"\"),CHAR(34),\"\"),\"\")","v":""},{"$f":"IF(LEN(D97)>150,\"NC\",\"\")","v":""},{"$f":"IF(E97<>\"\",LEN(SUM(MID(0&E97,LARGE(ISNUMBER(--MID(E97,ROW(INDIRECT(\"1:\"&LEN(E97))),1))* ROW(INDIRECT(\"1:\"&LEN(E97))),ROW(INDIRECT(\"1:\"&LEN(E97))))+1,1)*10^ROW(INDIRECT(\"1:\"&LEN(E97)))/10)),\"\")","v":""},"",{"$f":"IF(X97=\"CV\",LEFT(E97,2)&\"-\"&RIGHT(E97,7),\"\")","v":""},{"$f":"IF(F97=\"\",\"\",IF(F97=\"Nonprofit\",IF(EXACT(UPPER(LEFT(F97,1)),LEFT(F97,1)),\"C\",\"CV\"),IF(F97=\"For Profit\",IF(AND(EXACT(UPPER(LEFT(F97,1)),LEFT(F97,1)),EXACT(UPPER(MID(F97,5,1)),MID(F97,5,1))),\"C\",\"CV\"),\"NC\")))","v":""},{"$f":"IF(AND(ISERR(FIND(\"*\",G97)),ISERR(FIND(\"<\",G97)),ISERR(FIND(\">\",G97)),ISERR(FIND(\"\\\",G97)),ISERR(FIND(\"/\",G97)),ISERR(FIND(\"%\",G97)),ISERR(FIND(\"^\",G97)),ISERR(FIND(\"`\",G97)),ISERR(FIND(\"{\",G97)),ISERR(FIND(\"}\",G97)),ISERR(FIND(\"~\",G97)),ISERR(FIND(\"[\",G97)),ISERR(FIND(\"]\",G97)),ISERR(FIND(\"!\",G97)),ISERR(FIND(\"&\",G97)),ISERR(FIND(\"+\",G97)),ISERR(FIND(\"=\",G97)),ISERR(FIND(\"?\",G97)),ISERR(FIND(\"#\",G97)),ISERR(FIND(CHAR(34),G97))),\"\",\"CV\")","v":""},{"$f":"IF(AA97=\"CV\",SUBSTITUTE(SUBSTITUTE(SUBSTITUTE(SUBSTITUTE(SUBSTITUTE(SUBSTITUTE(SUBSTITUTE(SUBSTITUTE(SUBSTITUTE(SUBSTITUTE(SUBSTITUTE(SUBSTITUTE(SUBSTITUTE(SUBSTITUTE(SUBSTITUTE(SUBSTITUTE(SUBSTITUTE(SUBSTITUTE(SUBSTITUTE(SUBSTITUTE(G97,\"*\",\"\"),\"<\",\"\"),\">\",\"\"),\"\\\",\"\"),\"/\",\"\"),\"%\",\"\"),\"^\",\"\"),\"`\",\"\"),\"{\",\"\"),\"}\",\"\"),\"~\",\"\"),\"[\",\"\"),\"]\",\"\"),\"!\",\"\"),\"&\",\"\"),\"+\",\"\"),\"=\",\"\"),\"?\",\"\"),\"#\",\"\"),CHAR(34),\"\"),\"\")","v":""},{"$f":"IF(LEN(G97)>150,\"NC\",\"\")","v":""},{"$f":"IF(AND(ISERR(FIND(\"*\",H97)),ISERR(FIND(\"<\",H97)),ISERR(FIND(\">\",H97)),ISERR(FIND(\"\\\",H97)),ISERR(FIND(\"/\",H97)),ISERR(FIND(\"%\",H97)),ISERR(FIND(\"^\",H97)),ISERR(FIND(\"`\",H97)),ISERR(FIND(\"{\",H97)),ISERR(FIND(\"}\",H97)),ISERR(FIND(\"~\",H97)),ISERR(FIND(\"[\",H97)),ISERR(FIND(\"]\",H97)),ISERR(FIND(\"!\",H97)),ISERR(FIND(\"&\",H97)),ISERR(FIND(\"+\",H97)),ISERR(FIND(\"=\",H97)),ISERR(FIND(\"?\",H97)),ISERR(FIND(\"#\",H97)),ISERR(FIND(CHAR(34),H97))),\"\",\"CV\")","v":""},{"$f":"IF(AD97=\"CV\",SUBSTITUTE(SUBSTITUTE(SUBSTITUTE(SUBSTITUTE(SUBSTITUTE(SUBSTITUTE(SUBSTITUTE(SUBSTITUTE(SUBSTITUTE(SUBSTITUTE(SUBSTITUTE(SUBSTITUTE(SUBSTITUTE(SUBSTITUTE(SUBSTITUTE(SUBSTITUTE(SUBSTITUTE(SUBSTITUTE(SUBSTITUTE(SUBSTITUTE(H97,\"*\",\"\"),\"<\",\"\"),\">\",\"\"),\"\\\",\"\"),\"/\",\"\"),\"%\",\"\"),\"^\",\"\"),\"`\",\"\"),\"{\",\"\"),\"}\",\"\"),\"~\",\"\"),\"[\",\"\"),\"]\",\"\"),\"!\",\"\"),\"&\",\"\"),\"+\",\"\"),\"=\",\"\"),\"?\",\"\"),\"#\",\"\"),CHAR(34),\"\"),\"\")","v":""},{"$f":"IF(LEN(H97)>150,\"NC\",\"\")","v":""},{"$f":"IF(AND(ISERR(FIND(\"*\",I97)),ISERR(FIND(\"<\",I97)),ISERR(FIND(\">\",I97)),ISERR(FIND(\"\\\",I97)),ISERR(FIND(\"/\",I97)),ISERR(FIND(\"%\",I97)),ISERR(FIND(\"^\",I97)),ISERR(FIND(\"`\",I97)),ISERR(FIND(\"{\",I97)),ISERR(FIND(\"}\",I97)),ISERR(FIND(\"~\",I97)),ISERR(FIND(\"[\",I97)),ISERR(FIND(\"]\",I97)),ISERR(FIND(\"!\",I97)),ISERR(FIND(\"&\",I97)),ISERR(FIND(\"+\",I97)),ISERR(FIND(\"=\",I97)),ISERR(FIND(\"?\",I97)),ISERR(FIND(\"#\",I97)),ISERR(FIND(CHAR(34),I97))),\"\",\"CV\")","v":""},{"$f":"IF(AG97=\"CV\",SUBSTITUTE(SUBSTITUTE(SUBSTITUTE(SUBSTITUTE(SUBSTITUTE(SUBSTITUTE(SUBSTITUTE(SUBSTITUTE(SUBSTITUTE(SUBSTITUTE(SUBSTITUTE(SUBSTITUTE(SUBSTITUTE(SUBSTITUTE(SUBSTITUTE(SUBSTITUTE(SUBSTITUTE(SUBSTITUTE(SUBSTITUTE(SUBSTITUTE(I97,\"*\",\"\"),\"<\",\"\"),\">\",\"\"),\"\\\",\"\"),\"/\",\"\"),\"%\",\"\"),\"^\",\"\"),\"`\",\"\"),\"{\",\"\"),\"}\",\"\"),\"~\",\"\"),\"[\",\"\"),\"]\",\"\"),\"!\",\"\"),\"&\",\"\"),\"+\",\"\"),\"=\",\"\"),\"?\",\"\"),\"#\",\"\"),CHAR(34),\"\"),\"\")","v":""},{"$f":"IF(LEN(I97)>150,\"NC\",\"\")","v":""},{"$f":"IF(J97=\"\",\"\",IF(ISNA(MATCH(J97,Arrays!$G$3:$G$58,0)),IF(ISNA(MATCH(J97,Arrays!$H$3:$H$58,0)),\"NC\",\"CV\"),IF(EXACT(UPPER(J97),J97),\"C\",\"CV\")))","v":""},{"$f":"IF(AJ97=\"CV\",IF(ISNA(MATCH(J97,Arrays!$G$3:$G$58,0)),INDEX(Arrays!$G$3:$H$58,MATCH(J97,Arrays!$H$3:$H$58,0),1),UPPER(J97)),\"\")","v":""},{"$f":"IF(K97=\"\",\"\",LEN(SUM(MID(0&K97,LARGE(ISNUMBER(--MID(K97,ROW(INDIRECT(\"1:\"&LEN(K97))),1))* ROW(INDIRECT(\"1:\"&LEN(K97))),ROW(INDIRECT(\"1:\"&LEN(K97))))+1,1)*10^ROW(INDIRECT(\"1:\"&LEN(K97)))/10)))","v":""},{"$f":"IF(K97=\"\",\"\",IF(OR(AND(AL97=5,LEN(K97)=5),AND(AL97=9,LEN(K97)=10,MID(K97,6,1)=\"-\"),AND(AL97=4,LEN(K97)=5,LEFT(K97,1)=\"0\"),AND(AL97=8,LEN(K97)=10,MID(K97,6,1)=\"-\",LEFT(K97,1)=\"0\")),\"C\",IF(OR(AND(AL97=9,LEN(K97)=9),AND(AL97=8,LEN(K97)=9,LEFT(K97,1)=\"0\")),\"CV\",\"NC\")))","v":""},{"$f":"IF(K97=\"\",\"\",IF(ISTEXT(K97),\"\",TEXT(K97,\"##\")))","v":""},{"$f":"IF(AN97<>\"CV\",IF(AM97=\"CV\",LEFT(K97,5)&\"-\"&RIGHT(K97,4),\"\"),IF(LEN(K97)=5,TEXT(K97,\"#\"),IF(AN97=\"CV\",LEFT(K97,5)&\"-\"&RIGHT(K97,4),IF(AND(LEN(K97)=3,(COUNTIFS(Arrays!$I$3:$I$7,'Data Entry Worksheet'!#REF!,Arrays!$K$3:$K$7,LEFT(K97,1))+COUNTIFS(Arrays!$J$3:$J$7,'Data Entry Worksheet'!#REF!,Arrays!$K$3:$K$7,LEFT(K97,1)))>0),\"00\"&TEXT(K97,\"#\"),IF(AND(LEN(K97)=4,(COUNTIFS(Arrays!$M$3:$M$13,'Data Entry Worksheet'!#REF!,Arrays!$O$3:$O$13,LEFT(K97,1))+COUNTIFS(Arrays!$N$3:$N$13,'Data Entry Worksheet'!#REF!,Arrays!$O$3:$O$13,LEFT(K97,1)))>0),\"0\"&TEXT(K97,\"#\"),\"\")))))","v":""},{"$f":"IF(L97=\"\",\"\",IF(ISNA(MATCH(L97,Arrays!$G$3:$G$58,0)),IF(ISNA(MATCH(L97,Arrays!$H$3:$H$58,0)),\"NC\",\"CV\"),IF(EXACT(UPPER(L97),L97),\"C\",\"CV\")))","v":""},{"$f":"IF(AP97=\"CV\",IF(ISNA(MATCH(L97,Arrays!$G$3:$G$58,0)),INDEX(Arrays!$G$3:$H$58,MATCH(L97,Arrays!$H$3:$H$58,0),1),UPPER(L97)),\"\")","v":""},{"$f":"IF(M97=\"\",\"\",IF(ISERR(1*M97),\"NC\",IF(AND(1*M97<=YEAR(TODAY()),1*M97>2013),\"C\",\"NC\")))","v":""},{"$f":"IF(OR(F97=\"C\",F97=\"\"),\"\",IF(F97=\"nonprofit\",\"Nonprofit\",\"For Profit\"))","v":""},{"$f":"IF(AS97=\"CV\",TEXT(M97,\"##\"),\"\")","v":""},{"$f":"IF(N97=\"\",\"\",IF(ISERR(1*N97),\"NC\",IF(ISTEXT(N97),\"TX\",\"C\")))","v":""},{"$f":"IF(AU97=\"TX\",1*N97,\"\")","v":""},{"$f":"IF(O97=\"\",\"\",IF(ISNA(MATCH(O97,Arrays!$G$60:$G$65,0)),\"NC\",IF(EXACT(UPPER(O97),O97),\"C\",\"CV\")))","v":""},{"$f":"IF(AW97=\"\",\"\",UPPER(O97))","v":""}]
[{"$f":"IF(COUNTIF(D98:O98,\"\")<>12,ROW()-17,IF(COUNT(INDIRECT(ADDRESS(ROW()+1,COLUMN(),4)&\":A50000\"))>0,ROW()-17,\"\"))","v":""},{"$f":"IF(A98<>\"\",D$3,\"\")","v":""},{"$f":"IF(B98<>\"\",D$5,\"\")","v":""},null,null,null,null,null,null,null,null,null,null,null,null,"","",{"$f":"IF(COUNTIF(T98:AX98,\"NC\")>0,\"Error\"&IF(COUNTIF(T98:AX98,\"CV\")>0,\"/Format\",\"\"),IF(COUNTIF(T98:AX98,\"CV\")>0,\"Format\",\"\"))","v":""},null,{"$f":"IF(AND(ISERR(FIND(\"*\",D98)),ISERR(FIND(\"<\",D98)),ISERR(FIND(\">\",D98)),ISERR(FIND(\"\\\",D98)),ISERR(FIND(\"/\",D98)),ISERR(FIND(\"%\",D98)),ISERR(FIND(\"^\",D98)),ISERR(FIND(\"`\",D98)),ISERR(FIND(\"{\",D98)),ISERR(FIND(\"}\",D98)),ISERR(FIND(\"~\",D98)),ISERR(FIND(\"[\",D98)),ISERR(FIND(\"]\",D98)),ISERR(FIND(\"!\",D98)),ISERR(FIND(\"&\",D98)),ISERR(FIND(\"+\",D98)),ISERR(FIND(\"=\",D98)),ISERR(FIND(\"?\",D98)),ISERR(FIND(\"#\",D98)),ISERR(FIND(CHAR(34),D98))),\"\",\"CV\")","v":""},{"$f":"IF(T98=\"CV\",SUBSTITUTE(SUBSTITUTE(SUBSTITUTE(SUBSTITUTE(SUBSTITUTE(SUBSTITUTE(SUBSTITUTE(SUBSTITUTE(SUBSTITUTE(SUBSTITUTE(SUBSTITUTE(SUBSTITUTE(SUBSTITUTE(SUBSTITUTE(SUBSTITUTE(SUBSTITUTE(SUBSTITUTE(SUBSTITUTE(SUBSTITUTE(SUBSTITUTE(D98,\"*\",\"\"),\"<\",\"\"),\">\",\"\"),\"\\\",\"\"),\"/\",\"\"),\"%\",\"\"),\"^\",\"\"),\"`\",\"\"),\"{\",\"\"),\"}\",\"\"),\"~\",\"\"),\"[\",\"\"),\"]\",\"\"),\"!\",\"\"),\"&\",\"\"),\"+\",\"\"),\"=\",\"\"),\"?\",\"\"),\"#\",\"\"),CHAR(34),\"\"),\"\")","v":""},{"$f":"IF(LEN(D98)>150,\"NC\",\"\")","v":""},{"$f":"IF(E98<>\"\",LEN(SUM(MID(0&E98,LARGE(ISNUMBER(--MID(E98,ROW(INDIRECT(\"1:\"&LEN(E98))),1))* ROW(INDIRECT(\"1:\"&LEN(E98))),ROW(INDIRECT(\"1:\"&LEN(E98))))+1,1)*10^ROW(INDIRECT(\"1:\"&LEN(E98)))/10)),\"\")","v":""},"",{"$f":"IF(X98=\"CV\",LEFT(E98,2)&\"-\"&RIGHT(E98,7),\"\")","v":""},{"$f":"IF(F98=\"\",\"\",IF(F98=\"Nonprofit\",IF(EXACT(UPPER(LEFT(F98,1)),LEFT(F98,1)),\"C\",\"CV\"),IF(F98=\"For Profit\",IF(AND(EXACT(UPPER(LEFT(F98,1)),LEFT(F98,1)),EXACT(UPPER(MID(F98,5,1)),MID(F98,5,1))),\"C\",\"CV\"),\"NC\")))","v":""},{"$f":"IF(AND(ISERR(FIND(\"*\",G98)),ISERR(FIND(\"<\",G98)),ISERR(FIND(\">\",G98)),ISERR(FIND(\"\\\",G98)),ISERR(FIND(\"/\",G98)),ISERR(FIND(\"%\",G98)),ISERR(FIND(\"^\",G98)),ISERR(FIND(\"`\",G98)),ISERR(FIND(\"{\",G98)),ISERR(FIND(\"}\",G98)),ISERR(FIND(\"~\",G98)),ISERR(FIND(\"[\",G98)),ISERR(FIND(\"]\",G98)),ISERR(FIND(\"!\",G98)),ISERR(FIND(\"&\",G98)),ISERR(FIND(\"+\",G98)),ISERR(FIND(\"=\",G98)),ISERR(FIND(\"?\",G98)),ISERR(FIND(\"#\",G98)),ISERR(FIND(CHAR(34),G98))),\"\",\"CV\")","v":""},{"$f":"IF(AA98=\"CV\",SUBSTITUTE(SUBSTITUTE(SUBSTITUTE(SUBSTITUTE(SUBSTITUTE(SUBSTITUTE(SUBSTITUTE(SUBSTITUTE(SUBSTITUTE(SUBSTITUTE(SUBSTITUTE(SUBSTITUTE(SUBSTITUTE(SUBSTITUTE(SUBSTITUTE(SUBSTITUTE(SUBSTITUTE(SUBSTITUTE(SUBSTITUTE(SUBSTITUTE(G98,\"*\",\"\"),\"<\",\"\"),\">\",\"\"),\"\\\",\"\"),\"/\",\"\"),\"%\",\"\"),\"^\",\"\"),\"`\",\"\"),\"{\",\"\"),\"}\",\"\"),\"~\",\"\"),\"[\",\"\"),\"]\",\"\"),\"!\",\"\"),\"&\",\"\"),\"+\",\"\"),\"=\",\"\"),\"?\",\"\"),\"#\",\"\"),CHAR(34),\"\"),\"\")","v":""},{"$f":"IF(LEN(G98)>150,\"NC\",\"\")","v":""},{"$f":"IF(AND(ISERR(FIND(\"*\",H98)),ISERR(FIND(\"<\",H98)),ISERR(FIND(\">\",H98)),ISERR(FIND(\"\\\",H98)),ISERR(FIND(\"/\",H98)),ISERR(FIND(\"%\",H98)),ISERR(FIND(\"^\",H98)),ISERR(FIND(\"`\",H98)),ISERR(FIND(\"{\",H98)),ISERR(FIND(\"}\",H98)),ISERR(FIND(\"~\",H98)),ISERR(FIND(\"[\",H98)),ISERR(FIND(\"]\",H98)),ISERR(FIND(\"!\",H98)),ISERR(FIND(\"&\",H98)),ISERR(FIND(\"+\",H98)),ISERR(FIND(\"=\",H98)),ISERR(FIND(\"?\",H98)),ISERR(FIND(\"#\",H98)),ISERR(FIND(CHAR(34),H98))),\"\",\"CV\")","v":""},{"$f":"IF(AD98=\"CV\",SUBSTITUTE(SUBSTITUTE(SUBSTITUTE(SUBSTITUTE(SUBSTITUTE(SUBSTITUTE(SUBSTITUTE(SUBSTITUTE(SUBSTITUTE(SUBSTITUTE(SUBSTITUTE(SUBSTITUTE(SUBSTITUTE(SUBSTITUTE(SUBSTITUTE(SUBSTITUTE(SUBSTITUTE(SUBSTITUTE(SUBSTITUTE(SUBSTITUTE(H98,\"*\",\"\"),\"<\",\"\"),\">\",\"\"),\"\\\",\"\"),\"/\",\"\"),\"%\",\"\"),\"^\",\"\"),\"`\",\"\"),\"{\",\"\"),\"}\",\"\"),\"~\",\"\"),\"[\",\"\"),\"]\",\"\"),\"!\",\"\"),\"&\",\"\"),\"+\",\"\"),\"=\",\"\"),\"?\",\"\"),\"#\",\"\"),CHAR(34),\"\"),\"\")","v":""},{"$f":"IF(LEN(H98)>150,\"NC\",\"\")","v":""},{"$f":"IF(AND(ISERR(FIND(\"*\",I98)),ISERR(FIND(\"<\",I98)),ISERR(FIND(\">\",I98)),ISERR(FIND(\"\\\",I98)),ISERR(FIND(\"/\",I98)),ISERR(FIND(\"%\",I98)),ISERR(FIND(\"^\",I98)),ISERR(FIND(\"`\",I98)),ISERR(FIND(\"{\",I98)),ISERR(FIND(\"}\",I98)),ISERR(FIND(\"~\",I98)),ISERR(FIND(\"[\",I98)),ISERR(FIND(\"]\",I98)),ISERR(FIND(\"!\",I98)),ISERR(FIND(\"&\",I98)),ISERR(FIND(\"+\",I98)),ISERR(FIND(\"=\",I98)),ISERR(FIND(\"?\",I98)),ISERR(FIND(\"#\",I98)),ISERR(FIND(CHAR(34),I98))),\"\",\"CV\")","v":""},{"$f":"IF(AG98=\"CV\",SUBSTITUTE(SUBSTITUTE(SUBSTITUTE(SUBSTITUTE(SUBSTITUTE(SUBSTITUTE(SUBSTITUTE(SUBSTITUTE(SUBSTITUTE(SUBSTITUTE(SUBSTITUTE(SUBSTITUTE(SUBSTITUTE(SUBSTITUTE(SUBSTITUTE(SUBSTITUTE(SUBSTITUTE(SUBSTITUTE(SUBSTITUTE(SUBSTITUTE(I98,\"*\",\"\"),\"<\",\"\"),\">\",\"\"),\"\\\",\"\"),\"/\",\"\"),\"%\",\"\"),\"^\",\"\"),\"`\",\"\"),\"{\",\"\"),\"}\",\"\"),\"~\",\"\"),\"[\",\"\"),\"]\",\"\"),\"!\",\"\"),\"&\",\"\"),\"+\",\"\"),\"=\",\"\"),\"?\",\"\"),\"#\",\"\"),CHAR(34),\"\"),\"\")","v":""},{"$f":"IF(LEN(I98)>150,\"NC\",\"\")","v":""},{"$f":"IF(J98=\"\",\"\",IF(ISNA(MATCH(J98,Arrays!$G$3:$G$58,0)),IF(ISNA(MATCH(J98,Arrays!$H$3:$H$58,0)),\"NC\",\"CV\"),IF(EXACT(UPPER(J98),J98),\"C\",\"CV\")))","v":""},{"$f":"IF(AJ98=\"CV\",IF(ISNA(MATCH(J98,Arrays!$G$3:$G$58,0)),INDEX(Arrays!$G$3:$H$58,MATCH(J98,Arrays!$H$3:$H$58,0),1),UPPER(J98)),\"\")","v":""},{"$f":"IF(K98=\"\",\"\",LEN(SUM(MID(0&K98,LARGE(ISNUMBER(--MID(K98,ROW(INDIRECT(\"1:\"&LEN(K98))),1))* ROW(INDIRECT(\"1:\"&LEN(K98))),ROW(INDIRECT(\"1:\"&LEN(K98))))+1,1)*10^ROW(INDIRECT(\"1:\"&LEN(K98)))/10)))","v":""},{"$f":"IF(K98=\"\",\"\",IF(OR(AND(AL98=5,LEN(K98)=5),AND(AL98=9,LEN(K98)=10,MID(K98,6,1)=\"-\"),AND(AL98=4,LEN(K98)=5,LEFT(K98,1)=\"0\"),AND(AL98=8,LEN(K98)=10,MID(K98,6,1)=\"-\",LEFT(K98,1)=\"0\")),\"C\",IF(OR(AND(AL98=9,LEN(K98)=9),AND(AL98=8,LEN(K98)=9,LEFT(K98,1)=\"0\")),\"CV\",\"NC\")))","v":""},{"$f":"IF(K98=\"\",\"\",IF(ISTEXT(K98),\"\",TEXT(K98,\"##\")))","v":""},{"$f":"IF(AN98<>\"CV\",IF(AM98=\"CV\",LEFT(K98,5)&\"-\"&RIGHT(K98,4),\"\"),IF(LEN(K98)=5,TEXT(K98,\"#\"),IF(AN98=\"CV\",LEFT(K98,5)&\"-\"&RIGHT(K98,4),IF(AND(LEN(K98)=3,(COUNTIFS(Arrays!$I$3:$I$7,'Data Entry Worksheet'!#REF!,Arrays!$K$3:$K$7,LEFT(K98,1))+COUNTIFS(Arrays!$J$3:$J$7,'Data Entry Worksheet'!#REF!,Arrays!$K$3:$K$7,LEFT(K98,1)))>0),\"00\"&TEXT(K98,\"#\"),IF(AND(LEN(K98)=4,(COUNTIFS(Arrays!$M$3:$M$13,'Data Entry Worksheet'!#REF!,Arrays!$O$3:$O$13,LEFT(K98,1))+COUNTIFS(Arrays!$N$3:$N$13,'Data Entry Worksheet'!#REF!,Arrays!$O$3:$O$13,LEFT(K98,1)))>0),\"0\"&TEXT(K98,\"#\"),\"\")))))","v":""},{"$f":"IF(L98=\"\",\"\",IF(ISNA(MATCH(L98,Arrays!$G$3:$G$58,0)),IF(ISNA(MATCH(L98,Arrays!$H$3:$H$58,0)),\"NC\",\"CV\"),IF(EXACT(UPPER(L98),L98),\"C\",\"CV\")))","v":""},{"$f":"IF(AP98=\"CV\",IF(ISNA(MATCH(L98,Arrays!$G$3:$G$58,0)),INDEX(Arrays!$G$3:$H$58,MATCH(L98,Arrays!$H$3:$H$58,0),1),UPPER(L98)),\"\")","v":""},{"$f":"IF(M98=\"\",\"\",IF(ISERR(1*M98),\"NC\",IF(AND(1*M98<=YEAR(TODAY()),1*M98>2013),\"C\",\"NC\")))","v":""},{"$f":"IF(OR(F98=\"C\",F98=\"\"),\"\",IF(F98=\"nonprofit\",\"Nonprofit\",\"For Profit\"))","v":""},{"$f":"IF(AS98=\"CV\",TEXT(M98,\"##\"),\"\")","v":""},{"$f":"IF(N98=\"\",\"\",IF(ISERR(1*N98),\"NC\",IF(ISTEXT(N98),\"TX\",\"C\")))","v":""},{"$f":"IF(AU98=\"TX\",1*N98,\"\")","v":""},{"$f":"IF(O98=\"\",\"\",IF(ISNA(MATCH(O98,Arrays!$G$60:$G$65,0)),\"NC\",IF(EXACT(UPPER(O98),O98),\"C\",\"CV\")))","v":""},{"$f":"IF(AW98=\"\",\"\",UPPER(O98))","v":""}]
[{"$f":"IF(COUNTIF(D99:O99,\"\")<>12,ROW()-17,IF(COUNT(INDIRECT(ADDRESS(ROW()+1,COLUMN(),4)&\":A50000\"))>0,ROW()-17,\"\"))","v":""},{"$f":"IF(A99<>\"\",D$3,\"\")","v":""},{"$f":"IF(B99<>\"\",D$5,\"\")","v":""},null,null,null,null,null,null,null,null,null,null,null,null,"","",{"$f":"IF(COUNTIF(T99:AX99,\"NC\")>0,\"Error\"&IF(COUNTIF(T99:AX99,\"CV\")>0,\"/Format\",\"\"),IF(COUNTIF(T99:AX99,\"CV\")>0,\"Format\",\"\"))","v":""},null,{"$f":"IF(AND(ISERR(FIND(\"*\",D99)),ISERR(FIND(\"<\",D99)),ISERR(FIND(\">\",D99)),ISERR(FIND(\"\\\",D99)),ISERR(FIND(\"/\",D99)),ISERR(FIND(\"%\",D99)),ISERR(FIND(\"^\",D99)),ISERR(FIND(\"`\",D99)),ISERR(FIND(\"{\",D99)),ISERR(FIND(\"}\",D99)),ISERR(FIND(\"~\",D99)),ISERR(FIND(\"[\",D99)),ISERR(FIND(\"]\",D99)),ISERR(FIND(\"!\",D99)),ISERR(FIND(\"&\",D99)),ISERR(FIND(\"+\",D99)),ISERR(FIND(\"=\",D99)),ISERR(FIND(\"?\",D99)),ISERR(FIND(\"#\",D99)),ISERR(FIND(CHAR(34),D99))),\"\",\"CV\")","v":""},{"$f":"IF(T99=\"CV\",SUBSTITUTE(SUBSTITUTE(SUBSTITUTE(SUBSTITUTE(SUBSTITUTE(SUBSTITUTE(SUBSTITUTE(SUBSTITUTE(SUBSTITUTE(SUBSTITUTE(SUBSTITUTE(SUBSTITUTE(SUBSTITUTE(SUBSTITUTE(SUBSTITUTE(SUBSTITUTE(SUBSTITUTE(SUBSTITUTE(SUBSTITUTE(SUBSTITUTE(D99,\"*\",\"\"),\"<\",\"\"),\">\",\"\"),\"\\\",\"\"),\"/\",\"\"),\"%\",\"\"),\"^\",\"\"),\"`\",\"\"),\"{\",\"\"),\"}\",\"\"),\"~\",\"\"),\"[\",\"\"),\"]\",\"\"),\"!\",\"\"),\"&\",\"\"),\"+\",\"\"),\"=\",\"\"),\"?\",\"\"),\"#\",\"\"),CHAR(34),\"\"),\"\")","v":""},{"$f":"IF(LEN(D99)>150,\"NC\",\"\")","v":""},{"$f":"IF(E99<>\"\",LEN(SUM(MID(0&E99,LARGE(ISNUMBER(--MID(E99,ROW(INDIRECT(\"1:\"&LEN(E99))),1))* ROW(INDIRECT(\"1:\"&LEN(E99))),ROW(INDIRECT(\"1:\"&LEN(E99))))+1,1)*10^ROW(INDIRECT(\"1:\"&LEN(E99)))/10)),\"\")","v":""},"",{"$f":"IF(X99=\"CV\",LEFT(E99,2)&\"-\"&RIGHT(E99,7),\"\")","v":""},{"$f":"IF(F99=\"\",\"\",IF(F99=\"Nonprofit\",IF(EXACT(UPPER(LEFT(F99,1)),LEFT(F99,1)),\"C\",\"CV\"),IF(F99=\"For Profit\",IF(AND(EXACT(UPPER(LEFT(F99,1)),LEFT(F99,1)),EXACT(UPPER(MID(F99,5,1)),MID(F99,5,1))),\"C\",\"CV\"),\"NC\")))","v":""},{"$f":"IF(AND(ISERR(FIND(\"*\",G99)),ISERR(FIND(\"<\",G99)),ISERR(FIND(\">\",G99)),ISERR(FIND(\"\\\",G99)),ISERR(FIND(\"/\",G99)),ISERR(FIND(\"%\",G99)),ISERR(FIND(\"^\",G99)),ISERR(FIND(\"`\",G99)),ISERR(FIND(\"{\",G99)),ISERR(FIND(\"}\",G99)),ISERR(FIND(\"~\",G99)),ISERR(FIND(\"[\",G99)),ISERR(FIND(\"]\",G99)),ISERR(FIND(\"!\",G99)),ISERR(FIND(\"&\",G99)),ISERR(FIND(\"+\",G99)),ISERR(FIND(\"=\",G99)),ISERR(FIND(\"?\",G99)),ISERR(FIND(\"#\",G99)),ISERR(FIND(CHAR(34),G99))),\"\",\"CV\")","v":""},{"$f":"IF(AA99=\"CV\",SUBSTITUTE(SUBSTITUTE(SUBSTITUTE(SUBSTITUTE(SUBSTITUTE(SUBSTITUTE(SUBSTITUTE(SUBSTITUTE(SUBSTITUTE(SUBSTITUTE(SUBSTITUTE(SUBSTITUTE(SUBSTITUTE(SUBSTITUTE(SUBSTITUTE(SUBSTITUTE(SUBSTITUTE(SUBSTITUTE(SUBSTITUTE(SUBSTITUTE(G99,\"*\",\"\"),\"<\",\"\"),\">\",\"\"),\"\\\",\"\"),\"/\",\"\"),\"%\",\"\"),\"^\",\"\"),\"`\",\"\"),\"{\",\"\"),\"}\",\"\"),\"~\",\"\"),\"[\",\"\"),\"]\",\"\"),\"!\",\"\"),\"&\",\"\"),\"+\",\"\"),\"=\",\"\"),\"?\",\"\"),\"#\",\"\"),CHAR(34),\"\"),\"\")","v":""},{"$f":"IF(LEN(G99)>150,\"NC\",\"\")","v":""},{"$f":"IF(AND(ISERR(FIND(\"*\",H99)),ISERR(FIND(\"<\",H99)),ISERR(FIND(\">\",H99)),ISERR(FIND(\"\\\",H99)),ISERR(FIND(\"/\",H99)),ISERR(FIND(\"%\",H99)),ISERR(FIND(\"^\",H99)),ISERR(FIND(\"`\",H99)),ISERR(FIND(\"{\",H99)),ISERR(FIND(\"}\",H99)),ISERR(FIND(\"~\",H99)),ISERR(FIND(\"[\",H99)),ISERR(FIND(\"]\",H99)),ISERR(FIND(\"!\",H99)),ISERR(FIND(\"&\",H99)),ISERR(FIND(\"+\",H99)),ISERR(FIND(\"=\",H99)),ISERR(FIND(\"?\",H99)),ISERR(FIND(\"#\",H99)),ISERR(FIND(CHAR(34),H99))),\"\",\"CV\")","v":""},{"$f":"IF(AD99=\"CV\",SUBSTITUTE(SUBSTITUTE(SUBSTITUTE(SUBSTITUTE(SUBSTITUTE(SUBSTITUTE(SUBSTITUTE(SUBSTITUTE(SUBSTITUTE(SUBSTITUTE(SUBSTITUTE(SUBSTITUTE(SUBSTITUTE(SUBSTITUTE(SUBSTITUTE(SUBSTITUTE(SUBSTITUTE(SUBSTITUTE(SUBSTITUTE(SUBSTITUTE(H99,\"*\",\"\"),\"<\",\"\"),\">\",\"\"),\"\\\",\"\"),\"/\",\"\"),\"%\",\"\"),\"^\",\"\"),\"`\",\"\"),\"{\",\"\"),\"}\",\"\"),\"~\",\"\"),\"[\",\"\"),\"]\",\"\"),\"!\",\"\"),\"&\",\"\"),\"+\",\"\"),\"=\",\"\"),\"?\",\"\"),\"#\",\"\"),CHAR(34),\"\"),\"\")","v":""},{"$f":"IF(LEN(H99)>150,\"NC\",\"\")","v":""},{"$f":"IF(AND(ISERR(FIND(\"*\",I99)),ISERR(FIND(\"<\",I99)),ISERR(FIND(\">\",I99)),ISERR(FIND(\"\\\",I99)),ISERR(FIND(\"/\",I99)),ISERR(FIND(\"%\",I99)),ISERR(FIND(\"^\",I99)),ISERR(FIND(\"`\",I99)),ISERR(FIND(\"{\",I99)),ISERR(FIND(\"}\",I99)),ISERR(FIND(\"~\",I99)),ISERR(FIND(\"[\",I99)),ISERR(FIND(\"]\",I99)),ISERR(FIND(\"!\",I99)),ISERR(FIND(\"&\",I99)),ISERR(FIND(\"+\",I99)),ISERR(FIND(\"=\",I99)),ISERR(FIND(\"?\",I99)),ISERR(FIND(\"#\",I99)),ISERR(FIND(CHAR(34),I99))),\"\",\"CV\")","v":""},{"$f":"IF(AG99=\"CV\",SUBSTITUTE(SUBSTITUTE(SUBSTITUTE(SUBSTITUTE(SUBSTITUTE(SUBSTITUTE(SUBSTITUTE(SUBSTITUTE(SUBSTITUTE(SUBSTITUTE(SUBSTITUTE(SUBSTITUTE(SUBSTITUTE(SUBSTITUTE(SUBSTITUTE(SUBSTITUTE(SUBSTITUTE(SUBSTITUTE(SUBSTITUTE(SUBSTITUTE(I99,\"*\",\"\"),\"<\",\"\"),\">\",\"\"),\"\\\",\"\"),\"/\",\"\"),\"%\",\"\"),\"^\",\"\"),\"`\",\"\"),\"{\",\"\"),\"}\",\"\"),\"~\",\"\"),\"[\",\"\"),\"]\",\"\"),\"!\",\"\"),\"&\",\"\"),\"+\",\"\"),\"=\",\"\"),\"?\",\"\"),\"#\",\"\"),CHAR(34),\"\"),\"\")","v":""},{"$f":"IF(LEN(I99)>150,\"NC\",\"\")","v":""},{"$f":"IF(J99=\"\",\"\",IF(ISNA(MATCH(J99,Arrays!$G$3:$G$58,0)),IF(ISNA(MATCH(J99,Arrays!$H$3:$H$58,0)),\"NC\",\"CV\"),IF(EXACT(UPPER(J99),J99),\"C\",\"CV\")))","v":""},{"$f":"IF(AJ99=\"CV\",IF(ISNA(MATCH(J99,Arrays!$G$3:$G$58,0)),INDEX(Arrays!$G$3:$H$58,MATCH(J99,Arrays!$H$3:$H$58,0),1),UPPER(J99)),\"\")","v":""},{"$f":"IF(K99=\"\",\"\",LEN(SUM(MID(0&K99,LARGE(ISNUMBER(--MID(K99,ROW(INDIRECT(\"1:\"&LEN(K99))),1))* ROW(INDIRECT(\"1:\"&LEN(K99))),ROW(INDIRECT(\"1:\"&LEN(K99))))+1,1)*10^ROW(INDIRECT(\"1:\"&LEN(K99)))/10)))","v":""},{"$f":"IF(K99=\"\",\"\",IF(OR(AND(AL99=5,LEN(K99)=5),AND(AL99=9,LEN(K99)=10,MID(K99,6,1)=\"-\"),AND(AL99=4,LEN(K99)=5,LEFT(K99,1)=\"0\"),AND(AL99=8,LEN(K99)=10,MID(K99,6,1)=\"-\",LEFT(K99,1)=\"0\")),\"C\",IF(OR(AND(AL99=9,LEN(K99)=9),AND(AL99=8,LEN(K99)=9,LEFT(K99,1)=\"0\")),\"CV\",\"NC\")))","v":""},{"$f":"IF(K99=\"\",\"\",IF(ISTEXT(K99),\"\",TEXT(K99,\"##\")))","v":""},{"$f":"IF(AN99<>\"CV\",IF(AM99=\"CV\",LEFT(K99,5)&\"-\"&RIGHT(K99,4),\"\"),IF(LEN(K99)=5,TEXT(K99,\"#\"),IF(AN99=\"CV\",LEFT(K99,5)&\"-\"&RIGHT(K99,4),IF(AND(LEN(K99)=3,(COUNTIFS(Arrays!$I$3:$I$7,'Data Entry Worksheet'!#REF!,Arrays!$K$3:$K$7,LEFT(K99,1))+COUNTIFS(Arrays!$J$3:$J$7,'Data Entry Worksheet'!#REF!,Arrays!$K$3:$K$7,LEFT(K99,1)))>0),\"00\"&TEXT(K99,\"#\"),IF(AND(LEN(K99)=4,(COUNTIFS(Arrays!$M$3:$M$13,'Data Entry Worksheet'!#REF!,Arrays!$O$3:$O$13,LEFT(K99,1))+COUNTIFS(Arrays!$N$3:$N$13,'Data Entry Worksheet'!#REF!,Arrays!$O$3:$O$13,LEFT(K99,1)))>0),\"0\"&TEXT(K99,\"#\"),\"\")))))","v":""},{"$f":"IF(L99=\"\",\"\",IF(ISNA(MATCH(L99,Arrays!$G$3:$G$58,0)),IF(ISNA(MATCH(L99,Arrays!$H$3:$H$58,0)),\"NC\",\"CV\"),IF(EXACT(UPPER(L99),L99),\"C\",\"CV\")))","v":""},{"$f":"IF(AP99=\"CV\",IF(ISNA(MATCH(L99,Arrays!$G$3:$G$58,0)),INDEX(Arrays!$G$3:$H$58,MATCH(L99,Arrays!$H$3:$H$58,0),1),UPPER(L99)),\"\")","v":""},{"$f":"IF(M99=\"\",\"\",IF(ISERR(1*M99),\"NC\",IF(AND(1*M99<=YEAR(TODAY()),1*M99>2013),\"C\",\"NC\")))","v":""},{"$f":"IF(OR(F99=\"C\",F99=\"\"),\"\",IF(F99=\"nonprofit\",\"Nonprofit\",\"For Profit\"))","v":""},{"$f":"IF(AS99=\"CV\",TEXT(M99,\"##\"),\"\")","v":""},{"$f":"IF(N99=\"\",\"\",IF(ISERR(1*N99),\"NC\",IF(ISTEXT(N99),\"TX\",\"C\")))","v":""},{"$f":"IF(AU99=\"TX\",1*N99,\"\")","v":""},{"$f":"IF(O99=\"\",\"\",IF(ISNA(MATCH(O99,Arrays!$G$60:$G$65,0)),\"NC\",IF(EXACT(UPPER(O99),O99),\"C\",\"CV\")))","v":""},{"$f":"IF(AW99=\"\",\"\",UPPER(O99))","v":""}]
["","","",null,null,null,null,null,null,null,null,null,null,null,null,"","","",null,"","","",{"$f":"IF(E100<>\"\",LEN(SUM(MID(0&E100,LARGE(ISNUMBER(--MID(E100,ROW(INDIRECT(\"1:\"&LEN(E100))),1))* ROW(INDIRECT(\"1:\"&LEN(E100))),ROW(INDIRECT(\"1:\"&LEN(E100))))+1,1)*10^ROW(INDIRECT(\"1:\"&LEN(E100)))/10)),\"\")","v":""},"","","","","","","","","","","","",{"$f":"IF(J100=\"\",\"\",IF(ISNA(MATCH(J100,Arrays!$G$3:$G$58,0)),IF(ISNA(MATCH(J100,Arrays!$H$3:$H$58,0)),\"NC\",\"CV\"),IF(EXACT(UPPER(J100),J100),\"C\",\"CV\")))","v":""},{"$f":"IF(AJ100=\"CV\",IF(ISNA(MATCH(J100,Arrays!$G$3:$G$58,0)),INDEX(Arrays!$G$3:$H$58,MATCH(J100,Arrays!$H$3:$H$58,0),1),UPPER(J100)),\"\")","v":""},{"$f":"IF(K100=\"\",\"\",LEN(SUM(MID(0&K100,LARGE(ISNUMBER(--MID(K100,ROW(INDIRECT(\"1:\"&LEN(K100))),1))* ROW(INDIRECT(\"1:\"&LEN(K100))),ROW(INDIRECT(\"1:\"&LEN(K100))))+1,1)*10^ROW(INDIRECT(\"1:\"&LEN(K100)))/10)))","v":""},"","",{"$f":"IF(AN100<>\"CV\",IF(AM100=\"CV\",LEFT(K100,5)&\"-\"&RIGHT(K100,4),\"\"),IF(LEN(K100)=5,TEXT(K100,\"#\"),IF(AN100=\"CV\",LEFT(K100,5)&\"-\"&RIGHT(K100,4),IF(AND(LEN(K100)=3,(COUNTIFS(Arrays!$I$3:$I$7,'Data Entry Worksheet'!#REF!,Arrays!$K$3:$K$7,LEFT(K100,1))+COUNTIFS(Arrays!$J$3:$J$7,'Data Entry Worksheet'!#REF!,Arrays!$K$3:$K$7,LEFT(K100,1)))>0),\"00\"&TEXT(K100,\"#\"),IF(AND(LEN(K100)=4,(COUNTIFS(Arrays!$M$3:$M$13,'Data Entry Worksheet'!#REF!,Arrays!$O$3:$O$13,LEFT(K100,1))+COUNTIFS(Arrays!$N$3:$N$13,'Data Entry Worksheet'!#REF!,Arrays!$O$3:$O$13,LEFT(K100,1)))>0),\"0\"&TEXT(K100,\"#\"),\"\")))))","v":""},{"$f":"IF(L100=\"\",\"\",IF(ISNA(MATCH(L100,Arrays!$G$3:$G$58,0)),IF(ISNA(MATCH(L100,Arrays!$H$3:$H$58,0)),\"NC\",\"CV\"),IF(EXACT(UPPER(L100),L100),\"C\",\"CV\")))","v":""},{"$f":"IF(AP100=\"CV\",IF(ISNA(MATCH(L100,Arrays!$G$3:$G$58,0)),INDEX(Arrays!$G$3:$H$58,MATCH(L100,Arrays!$H$3:$H$58,0),1),UPPER(L100)),\"\")","v":""},"","","","","",{"$f":"IF(O100=\"\",\"\",IF(ISNA(MATCH(O100,Arrays!$G$60:$G$65,0)),\"NC\",IF(EXACT(UPPER(O100),O100),\"C\",\"CV\")))","v":""},""]

{"sheet":"Code","index":1,"n_rows":129,"n_cols":16,"rows_kept":129,"cut":false,"hidden":true,"merged":[]}
["Data Field","Code","Value"]
["Remittance Type",null,{"$f":"IF('Data Entry Worksheet'!D7=\"\",\"\",'Data Entry Worksheet'!D7)","v":""}]
["Maximum enrollment",null,{"$f":"IF(C2=\"\",\"\",IF(ISNA(VLOOKUP(C2,Arrays!G81:H82,2,FALSE)),\"\",VLOOKUP(C2,Arrays!G81:H82,2,FALSE)))","v":""},{"$f":"TEXT(C3,\"#,##0.00\")","v":""}]
["Enrollment Count Prior to Current","EnCtP",0]
["Enrollment Count Current","EnCtC",{"$f":"SUM(INDIRECT(\"'Data Entry Worksheet'!N18:N\"&C12))","v":0},{"$f":"TEXT(C5,\"#,##0.00\")","v":"0.00"}]
["Enrollment Prior Percent of Max","EnPrP",{"$f":"IF(C3=\"\",\"\",C4/C3)","v":""}]
["Enrollment Current Percent of Max","EnPrC",{"$f":"IF(C3=\"\",\"\",C5/C$3)","v":""}]
["Active Row","ActRw",28]
["Enrollment Count Notification Level","EnCtNL",{"$f":"IF(OR(C7<0.25,C7=\"\"),0,IF(C7<0.5, IF(C6<0.25,1,0), IF(C7<0.75,IF(C6<0.5,2,0),IF(C7<0.9,IF(C6<0.75,3,0),IF(C7<=1,IF(C6<0.9,3.6,0),4)))))","v":0}]
["Enrollment Count Notification Text","EnPrMsg",{"$f":"IF(C3=\"\",\"\",\"You have reached \"&ROUND(C7,2)*100&\"% of the maximum Annual Enrollment Count. Your count for this form is currently \"&D5&\". The maximum amount for a \"&C2&\" is \"&D3&\".\")","v":""}]
["Skipped Rows","SkpCt",{"$f":"COUNTIF('Data Entry Worksheet'!P:P,\"Blank\")","v":0}]
["Last Row with a record","LstRw",{"$f":"IF(ISNA(MATCH(MAX('Data Entry Worksheet'!A:A),'Data Entry Worksheet'!A:A,0)),17,MATCH(MAX('Data Entry Worksheet'!A:A),'Data Entry Worksheet'!A:A,0))","v":17}]
["Skipped Row Notification Text","SkpRwMsg",{"$f":"\"There are currently \"&C11&\" blank records in the data entry area of the spreadsheet. Data must be entered in successive rows. Please choose one of the following options to continue.\"","v":"There are currently 0 blank records in the data entry area of the spreadsheet. Data must be entered in successive rows. Please choose one of the following options to continue."}]
["Auto-Error Checking Status","ErrStat","On"]
["Incomplete Rows","IncRc",{"$f":"COUNTIFS('Data Entry Worksheet'!P:P,\"Incomplete\",'Data Entry Worksheet'!S:S,\"<>\"&\"Ignore\")","v":0}]
["Incomplete Row Notification Text","IncRwMsg",{"$f":"IF(C15=1,\"There is currently \"&C15&\" record in this Form that contains\", \"There are currently \"&C15&\" records in this Form that contain\")&\" incomplete data (that you have not chosen to ignore). All records must contain information in required fields before you can convert the file to CSV format.\"","v":"There are currently 0 records in this Form that contain incomplete data (that you have not chosen to ignore). All records must contain information in required fields before you can convert the file to CSV format."}]
["Duplicate TINs","DupTIN",{"$f":"COUNTIF('Data Entry Worksheet'!Q:Q,\"Duplicate\")","v":0}]
["Duplicate TIN notification","DupTINMsg"]
["Entries with Special Characters","SCharCt",{"$f":"COUNTIF(INDIRECT(\"'Data Entry Worksheet'!T18:T\"&C$12),\"CV\")+COUNTIF(INDIRECT(\"'Data Entry Worksheet'!AA18:AA\"&C$12),\"CV\")+COUNTIF(INDIRECT(\"'Data Entry Worksheet'!AD18:AD\"&C$12),\"CV\")+COUNTIF(INDIRECT(\"'Data Entry Worksheet'!AG18:AG\"&C$12),\"CV\")","v":0},"Format",{"$f":"IF(C19=0,\"\",IF(OR(D19=\"Format\",D19=\"Error\"),LEFT(D19,1),\"\"))","v":""},{"$f":"IF(C19=0,\"\",IF(E19=\"F\",E19&COUNTIF(E$19:E19,\"F\"),IF(E19=\"E\",E19&COUNTIF(E$19:E19,\"E\"),\"\")))","v":""},{"$f":"\"  -  Special characters included in a field: \"&C19&\" entry(ies)\"","v":"  -  Special characters included in a field: 0 entry(ies)"},null,null,null,null,null,null,null,{"$f":"COUNTA('Data Entry Worksheet'!#REF!)","v":1}]
["Entries exceeding length restrictions","LenCt",{"$f":"COUNTIF(INDIRECT(\"'Data Entry Worksheet'!V18:V\"&C$12),\"NC\")+COUNTIF(INDIRECT(\"'Data Entry Worksheet'!AC18:AC\"&C$12),\"NC\")+COUNTIF(INDIRECT(\"'Data Entry Worksheet'!AF18:AF\"&C$12),\"NC\")+COUNTIF(INDIRECT(\"'Data Entry Worksheet'!AI18:AI\"&C$12),\"NC\")","v":0},"Error","",{"$f":"IF(C20=0,\"\",IF(E20=\"F\",E20&COUNTIF(E$19:E20,\"F\"),IF(E20=\"E\",E20&COUNTIF(E$19:E20,\"E\"),\"\")))","v":""},{"$f":"\"  -  Number of characters in a field exceeds maximum length: \"&C20&\" entry(ies)\"","v":"  -  Number of characters in a field exceeds maximum length: 0 entry(ies)"}]
["Records with TIN to have hyphen added","TINHyCt",{"$f":"COUNTIF(INDIRECT(\"'Data Entry Worksheet'!X18:X\"&C$12),\"CV\")","v":0},"Format","",{"$f":"IF(C21=0,\"\",IF(E21=\"F\",E21&COUNTIF(E$19:E21,\"F\"),IF(E21=\"E\",E21&COUNTIF(E$19:E21,\"E\"),\"\")))","v":""},{"$f":"\"  -  Federal Tax ID Number (TIN) is missing a hyphen: \"&C21&\" record(s)\"","v":"  -  Federal Tax ID Number (TIN) is missing a hyphen: 0 record(s)"}]
["Records with Nonconform TIN","TINNCCt",{"$f":"COUNTIF(INDIRECT(\"'Data Entry Worksheet'!X18:X\"&C$12),\"NC\")","v":0},"Error","",{"$f":"IF(C22=0,\"\",IF(E22=\"F\",E22&COUNTIF(E$19:E22,\"F\"),IF(E22=\"E\",E22&COUNTIF(E$19:E22,\"E\"),\"\")))","v":""},{"$f":"\"  -  Federal Tax ID Number (TIN) is invalid: \"&C22&\" record(s)\"","v":"  -  Federal Tax ID Number (TIN) is invalid: 0 record(s)"}]
["Records w Org Type nonconforming","OTNCCt",{"$f":"COUNTIF(INDIRECT(\"'Data Entry Worksheet'!Z18:Z\"&C$12),\"NC\")","v":0},"Error","",{"$f":"IF(C23=0,\"\",IF(E23=\"F\",E23&COUNTIF(E$19:E23,\"F\"),IF(E23=\"E\",E23&COUNTIF(E$19:E23,\"E\"),\"\")))","v":""},{"$f":"\"  -  Organization Type field contains an invalid value: \"&C23&\" record(s)\"","v":"  -  Organization Type field contains an invalid value: 0 record(s)"}]
["Records w Bill State to be converted","BSCvCt",{"$f":"COUNTIF(INDIRECT(\"'Data Entry Worksheet'!AJ18:AJ\"&C$12),\"CV\")","v":0},"Format","",{"$f":"IF(C24=0,\"\",IF(E24=\"F\",E24&COUNTIF(E$19:E24,\"F\"),IF(E24=\"E\",E24&COUNTIF(E$19:E24,\"E\"),\"\")))","v":""},{"$f":"\"  -  Billing Address State to be converted to capitalized 2-letter postal code: \"&C24&\" record(s)\"","v":"  -  Billing Address State to be converted to capitalized 2-letter postal code: 0 record(s)"}]
["Records w Bill State nonconforming","BSNCCt",{"$f":"COUNTIF(INDIRECT(\"'Data Entry Worksheet'!AJ18:AJ\"&C$12),\"NC\")","v":0},"Error","",{"$f":"IF(C25=0,\"\",IF(E25=\"F\",E25&COUNTIF(E$19:E25,\"F\"),IF(E25=\"E\",E25&COUNTIF(E$19:E25,\"E\"),\"\")))","v":""},{"$f":"\"  -  Billing Address State field contains an invalid value: \"&C25&\" record(s)\"","v":"  -  Billing Address State field contains an invalid value: 0 record(s)"}]
["Records with ZIP to have hyphen added","ZPHyCt",{"$f":"COUNTIF(INDIRECT(\"'Data Entry Worksheet'!AM18:AM\"&C$12),\"CV\")","v":0},"Format","",{"$f":"IF(C26=0,\"\",IF(E26=\"F\",E26&COUNTIF(E$19:E26,\"F\"),IF(E26=\"E\",E26&COUNTIF(E$19:E26,\"E\"),\"\")))","v":""},{"$f":"\"  -  Billing Address ZIP code is missing a hyphen: \"&C26&\" record(s)\"","v":"  -  Billing Address ZIP code is missing a hyphen: 0 record(s)"}]
["Records with Nonconform ZIP","ZPNCCt",{"$f":"COUNTIF(INDIRECT(\"'Data Entry Worksheet'!AM18:AM\"&C$12),\"NC\")","v":0},"Error","",{"$f":"IF(C27=0,\"\",IF(E27=\"F\",E27&COUNTIF(E$19:E27,\"F\"),IF(E27=\"E\",E27&COUNTIF(E$19:E27,\"E\"),\"\")))","v":""},{"$f":"\"  -  Billing Address ZIP code is invalid: \"&C27&\" record(s)\"","v":"  -  Billing Address ZIP code is invalid: 0 record(s)"}]
["Records w Dom State to be converted","DSCvCt",{"$f":"COUNTIF(INDIRECT(\"'Data Entry Worksheet'!AP18:AP\"&C$12),\"CV\")","v":0},"Format","",{"$f":"IF(C28=0,\"\",IF(E28=\"F\",E28&COUNTIF(E$19:E28,\"F\"),IF(E28=\"E\",E28&COUNTIF(E$19:E28,\"E\"),\"\")))","v":""},{"$f":"\"  -  Domiciliary State to be converted to capitalized 2-letter postal code: \"&C28&\" record(s)\"","v":"  -  Domiciliary State to be converted to capitalized 2-letter postal code: 0 record(s)"}]
["Records w Dom State nonconforming","DSNCCt",{"$f":"COUNTIF(INDIRECT(\"'Data Entry Worksheet'!AP18:AP\"&C$12),\"NC\")","v":0},"Error","",{"$f":"IF(C29=0,\"\",IF(E29=\"F\",E29&COUNTIF(E$19:E29,\"F\"),IF(E29=\"E\",E29&COUNTIF(E$19:E29,\"E\"),\"\")))","v":""},{"$f":"\"  -  Domiciliary State field contains an invalid value: \"&C29&\" record(s)\"","v":"  -  Domiciliary State field contains an invalid value: 0 record(s)"}]
["Records w Benefit Yr nonconforming","BYNCCt",{"$f":"COUNTIF(INDIRECT(\"'Data Entry Worksheet'!AR18:AR\"&C$12),\"NC\")","v":0},"Error","",{"$f":"IF(C30=0,\"\",IF(E30=\"F\",E30&COUNTIF(E$19:E30,\"F\"),IF(E30=\"E\",E30&COUNTIF(E$19:E30,\"E\"),\"\")))","v":""},{"$f":"\"  -  Benefit Year field contains an invalid value: \"&C30&\" record(s)\"","v":"  -  Benefit Year field contains an invalid value: 0 record(s)"}]
["Enrollment count nonconforming","EnNCCt",{"$f":"COUNTIF(INDIRECT(\"'Data Entry Worksheet'!AU18:AU\"&C$12),\"NC\")","v":0},"Error","",{"$f":"IF(C31=0,\"\",IF(E31=\"F\",E31&COUNTIF(E$19:E31,\"F\"),IF(E31=\"E\",E31&COUNTIF(E$19:E31,\"E\"),\"\")))","v":""},{"$f":"\"  -  Enrollment Count field contains an invalid value: \"&C31&\" record(s)\"","v":"  -  Enrollment Count field contains an invalid value: 0 record(s)"}]
["Records w Ent Type nonconforming","ETNCCt",{"$f":"COUNTIF(INDIRECT(\"'Data Entry Worksheet'!AW18:AW\"&C$12),\"NC\")","v":0},"Error","",{"$f":"IF(C32=0,\"\",IF(E32=\"F\",E32&COUNTIF(E$19:E33,\"F\"),IF(E32=\"E\",E32&COUNTIF(E$19:E33,\"E\"),\"\")))","v":""},{"$f":"\"  -  Entity Type field contains an invalid value: \"&C32&\" record(s)\"","v":"  -  Entity Type field contains an invalid value: 0 record(s)"}]
["Records with Org or Ent Type not caps","EnCvCt",{"$f":"COUNTIF(INDIRECT(\"'Data Entry Worksheet'!Z18:Z\"&C$12),\"CV\")+COUNTIF(INDIRECT(\"'Data Entry Worksheet'!AW18:AW\"&C$12),\"CV\")","v":0},"Format","",{"$f":"IF(C33=0,\"\",IF(E33=\"F\",E33&COUNTIF(E$19:E33,\"F\"),IF(E33=\"E\",E33&COUNTIF(E$19:E33,\"E\"),\"\")))","v":""},{"$f":"\"  -  Organization Type or Entity Type use inconsistent capitalization: \"&C33&\" entry(ies)\"","v":"  -  Organization Type or Entity Type use inconsistent capitalization: 0 entry(ies)"}]
["Total types of format warnings",null,null,null,null,{"$f":"COUNTIF(E$19:E$33,\"F\")","v":0}]
["Total types of error warnings",null,null,null,null,{"$f":"COUNTIF(E$19:E$33,\"E\")","v":0}]
["Total errors/warnings","ErrWrnCt",null,null,null,{"$f":"+F34+F35","v":0}]
["Error/Warning label lines","VSumLblLen",null,null,null,{"$f":"F36+IF(F34<>0,1,0)+IF(F35<>0,1,0)","v":0}]
["Validation summary message 1","VSumMsg1",null,{"$f":"IF(F38<>\"\",IF(OR(F38=\"FM\",F38=\"EM\"),\"Header\",IF(OR(AND(LEFT(F38,1)=\"F\",1*RIGHT(F38,1)=$F$34),AND(LEFT(F38,1)=\"E\",1*RIGHT(F38,1)=$F$35)),IF(E38=$F$37,\"End\",\"Break\"),\"\")),\"\")","v":""},1,{"$f":"IF(F$34<>0,IF(E38=1,\"FM\",IF(F$34>E38-2,\"F\"&(E38-1),IF(F$35<>0,IF(E38-F$34-1=1,\"EM\",IF(F$35>E38-F$34-3,\"E\"&(E38-F$34-2),\"\"))))),IF(F$35<>0,IF(E38=1,\"EM\",IF(F$35>E38-2,\"E\"&(E38-1),\"\")),\"\"))","v":""},{"$f":"IF(F38=\"\",\"\",IF(F38=\"FM\",\"Formatting requirements not met:\",IF(F38=\"EM\",\"Invalid values entered:\",INDEX(F$19:G$33,MATCH(F38,F$19:F$33,0),2))))","v":""}]
["Validation summary message 2","VSumMsg2",null,"",2,"",""]
["Validation summary message 3","VSumMsg3",null,"",3,"",""]
["Validation summary message 4","VSumMsg4",null,"",4,"",""]
["Validation summary message 5","VSumMsg5",null,"",5,"",""]
["Validation summary message 6","VSumMsg6",null,"",6,"",""]
["Validation summary message 7","VSumMsg7",null,"",7,"",""]
["Validation summary message 8","VSumMsg8",null,"",8,"",""]
["Validation summary message 9","VSumMsg9",null,"",9,"",""]
["Validation summary message 10","VSumMsg10",null,"",10,"",""]
["Validation summary message 11","VSumMsg11",null,"",11,"",""]
["Validation summary message 12","VSumMsg12",null,"",12,"",""]
["Validation summary message 13","VSumMsg13",null,"",13,"",""]
["Validation summary message 14","VSumMsg14",null,"",14,"",""]
["Validation summary message 15","VSumMsg15",null,"",15,"",""]
["Validation summary message 16","VSumMsg16",null,"",16,"","",null,null,null,null,null,null,null,null,{"$f":"COLUMN('Data Entry Worksheet'!W:W)","v":23}]
["Total Records with error messages","ErrRcCt",{"$f":"COUNTIF('Data Entry Worksheet'!R:R,\"Error\")+COUNTIF('Data Entry Worksheet'!R:R,\"Error/Format\")","v":0}]
["First Record with Error","FrstErrRc",{"$f":"IF(AND(ISNA(MATCH(\"Error\",'Data Entry Worksheet'!R:R,0)),ISNA(MATCH(\"Error/Format\",'Data Entry Worksheet'!R:R,0))),\"None\",IF(ISNA(MATCH(\"Error\",'Data Entry Worksheet'!R:R,0)),MATCH(\"Error/Format\",'Data Entry Worksheet'!R:R,0)-17,IF(ISNA(MATCH(\"Error/Format\",'Data Entry Worksheet'!R:R,0)),MATCH(\"Error\",'Data Entry Worksheet'!R:R,0)-17,MIN(MATCH(\"Error\",'Data Entry Worksheet'!R:R,0),MATCH(\"Error/Format\",'Data Entry Worksheet'!R:R,0))-17)))","v":"None"}]
["CE bus name exceed length restrictions","LenRcLBN",{"$f":"IF(INDEX('Data Entry Worksheet'!A:AX,MATCH(C$55,'Data Entry Worksheet'!A:A,0),COLUMN('Data Entry Worksheet'!V:V))=\"NC\",\"E\",\"\")","v":{"$error":"#N/A"}},{"$f":"IF(C56<>\"\",COUNTIF(C$56:C56,\"E\"),\"\")","v":{"$error":"#N/A"}},"  -  Number of characters in Contributing Entity Legal Business Name (LBN) exceeds maximum length (Column D)","Contributing Entity Legal Business Name (LBN) (Column D)","This field exceeds the maximum length of 150 characters. Please revise to meet the allowable field length.","D"]
["Nonconform TIN","TINNCCt",{"$f":"IF(INDEX('Data Entry Worksheet'!$A:$AX,MATCH(C$55,'Data Entry Worksheet'!$A:$A,0),COLUMN('Data Entry Worksheet'!X:X))=\"NC\",\"E\",\"\")","v":{"$error":"#N/A"}},{"$f":"IF(C57<>\"\",COUNTIF(C$56:C57,\"E\"),\"\")","v":{"$error":"#N/A"}},"  -  Federal Tax ID Number (TIN) is invalid (Column E)","Federal Tax ID Number (TIN) (Column E)","This field has an invalid value. Please verify the Federal Tax ID Number (TIN) and re-enter the data.","E"]
["Org Type nonconforming","OTNCCt",{"$f":"IF(INDEX('Data Entry Worksheet'!$A:$AX,MATCH(C$55,'Data Entry Worksheet'!$A:$A,0),COLUMN('Data Entry Worksheet'!Z:Z))=\"NC\",\"E\",\"\")","v":{"$error":"#N/A"}},{"$f":"IF(C58<>\"\",COUNTIF(C$56:C58,\"E\"),\"\")","v":{"$error":"#N/A"}},"  -  Organization Type field contains an invalid value (Column F)","Organization Type  (Column F)","This field has an invalid value. Please enter either ‘For Profit’ or ‘Nonprofit’ in this field.","F"]
["Bill Address Line 1 > length","LenRcAd1",{"$f":"IF(INDEX('Data Entry Worksheet'!$A:$AX,MATCH(C$55,'Data Entry Worksheet'!$A:$A,0),COLUMN('Data Entry Worksheet'!AC:AC))=\"NC\",\"E\",\"\")","v":{"$error":"#N/A"}},{"$f":"IF(C59<>\"\",COUNTIF(C$56:C59,\"E\"),\"\")","v":{"$error":"#N/A"}},"  -  Number of characters in Billing Address Line 1 exceeds maximum length (Column G)","Billing Address Line 1 (Column G)","This field exceeds the maximum length of 150 characters. Please revise to meet the allowable field length.","G"]
["Bill Address Line 2 > length","LenRcAd2",{"$f":"IF(INDEX('Data Entry Worksheet'!$A:$AX,MATCH(C$55,'Data Entry Worksheet'!$A:$A,0),COLUMN('Data Entry Worksheet'!AF:AF))=\"NC\",\"E\",\"\")","v":{"$error":"#N/A"}},{"$f":"IF(C60<>\"\",COUNTIF(C$56:C60,\"E\"),\"\")","v":{"$error":"#N/A"}},"  -  Number of characters in Billing Address Line 2 exceeds maximum length (Column H)","Billing Address Line 2 (Column H)","This field exceeds the maximum length of 150 characters. Please revise to meet the allowable field length.","H"]
["Bill Address City > length","LenRcCty",{"$f":"IF(INDEX('Data Entry Worksheet'!$A:$AX,MATCH(C$55,'Data Entry Worksheet'!$A:$A,0),COLUMN('Data Entry Worksheet'!AI:AI))=\"NC\",\"E\",\"\")","v":{"$error":"#N/A"}},{"$f":"IF(C61<>\"\",COUNTIF(C$56:C61,\"E\"),\"\")","v":{"$error":"#N/A"}},"  -  Number of characters in Billing Address City exceeds maximum length (Column I)","Billing Address City (Column I)","This field exceeds the maximum length of 150 characters. Please revise to meet the allowable field length.","I"]
["Bill State nonconforming","BSNCCt",{"$f":"IF(INDEX('Data Entry Worksheet'!$A:$AX,MATCH(C$55,'Data Entry Worksheet'!$A:$A,0),COLUMN('Data Entry Worksheet'!AJ:AJ))=\"NC\",\"E\",\"\")","v":{"$error":"#N/A"}},{"$f":"IF(C62<>\"\",COUNTIF(C$56:C62,\"E\"),\"\")","v":{"$error":"#N/A"}},"  -  Billing Address State field contains an invalid value (Column J)","Billing Address State (Column J)","This field has an invalid value. Please enter a valid 2-letter state postal code in this field.","J"]
["Nonconform ZIP","ZPNCCt",{"$f":"IF(INDEX('Data Entry Worksheet'!$A:$AX,MATCH(C$55,'Data Entry Worksheet'!$A:$A,0),COLUMN('Data Entry Worksheet'!AM:AM))=\"NC\",\"E\",\"\")","v":{"$error":"#N/A"}},{"$f":"IF(C63<>\"\",COUNTIF(C$56:C63,\"E\"),\"\")","v":{"$error":"#N/A"}},"  -  Billing Address ZIP code is invalid (Column K)","Billing Address ZIP Code (Column K)","This field has an invalid value. Please verify the ZIP code and re-enter the data.","K"]
["Dom State nonconforming","DSNCCt",{"$f":"IF(INDEX('Data Entry Worksheet'!$A:$AX,MATCH(C$55,'Data Entry Worksheet'!$A:$A,0),COLUMN('Data Entry Worksheet'!AP:AP))=\"NC\",\"E\",\"\")","v":{"$error":"#N/A"}},{"$f":"IF(C64<>\"\",COUNTIF(C$56:C64,\"E\"),\"\")","v":{"$error":"#N/A"}},"  -  Domiciliary State field contains an invalid value (Column L)","Domiciliary State (Column L)","This field has an invalid value. Please enter a valid 2-letter state postal code in this field.","L"]
["Benefit Yr nonconforming","BYNCCt",{"$f":"IF(INDEX('Data Entry Worksheet'!$A:$AX,MATCH(C$55,'Data Entry Worksheet'!$A:$A,0),COLUMN('Data Entry Worksheet'!AR:AR))=\"NC\",\"E\",\"\")","v":{"$error":"#N/A"}},{"$f":"IF(C65<>\"\",COUNTIF(C$56:C65,\"E\"),\"\")","v":{"$error":"#N/A"}},"  -  Benefit Year field contains an invalid value (Column M)","Benefit Year (Column M)",{"$f":"\"This field has an invalid value. Please enter \"&IF(YEAR(TODAY())=2014,\"2014\",IF(YEAR(TODAY())=2015,\"2014 or 2015\",\"2014, 2015, or 2016\"))&\" in this field.\"","v":"This field has an invalid value. Please enter 2014 in this field."},"M"]
["Enrollment count nonconforming","EnNCCt",{"$f":"IF(INDEX('Data Entry Worksheet'!$A:$AX,MATCH(C$55,'Data Entry Worksheet'!$A:$A,0),COLUMN('Data Entry Worksheet'!AU:AU))=\"NC\",\"E\",\"\")","v":{"$error":"#N/A"}},{"$f":"IF(C66<>\"\",COUNTIF(C$56:C66,\"E\"),\"\")","v":{"$error":"#N/A"}},"  -  Enrollment Count field contains an invalid value (Column N)","Enrollment Count (Column N)","This field has an invalid value. Please verify the Annual Enrollment Count and re-enter the data.","N"]
["Ent Type nonconforming","ETNCCt",{"$f":"IF(INDEX('Data Entry Worksheet'!$A:$AX,MATCH(C$55,'Data Entry Worksheet'!$A:$A,0),COLUMN('Data Entry Worksheet'!AW:AW))=\"NC\",\"E\",\"\")","v":{"$error":"#N/A"}},{"$f":"IF(C67<>\"\",COUNTIF(C$56:C67,\"E\"),\"\")","v":{"$error":"#N/A"}},"  -  Entity Type field contains an invalid value (Column O)","Entity Type (Column O)","This field has an invalid value. Please enter one of the following values: HII, SI, SISA, MGHPS, MGHPM, or OTHER.","O"]
["Total errors","ErrCt",null,{"$f":"MAX(D56:D67)","v":{"$error":"#N/A"}}]
["Record error message 1",null,{"$f":"IF(1*RIGHT(A69,1)>$D$68,\"\",INDEX($D$56:$E$67,MATCH(1*RIGHT(A69,1),$D$56:$D$67,0),2))","v":{"$error":"#N/A"}},{"$f":"VLOOKUP($C69,$E$56:$H$67,2,FALSE)","v":{"$error":"#N/A"}},{"$f":"VLOOKUP($C69,$E$56:$H$67,3,FALSE)","v":{"$error":"#N/A"}},{"$f":"VLOOKUP($C69,$E$56:$H$67,4,FALSE)&(C$55+17)","v":{"$error":"#N/A"}},{"$f":"VLOOKUP($C69,$E$56:$H$67,4,FALSE)","v":{"$error":"#N/A"}}]
["Record error message 2",null,{"$error":"#N/A"},{"$f":"VLOOKUP($C70,$E$56:$H$67,2,FALSE)","v":{"$error":"#N/A"}},{"$f":"VLOOKUP($C70,$E$56:$H$67,3,FALSE)","v":{"$error":"#N/A"}},{"$f":"VLOOKUP($C70,$E$56:$H$67,4,FALSE)&(C$55+17)","v":{"$error":"#N/A"}},{"$f":"VLOOKUP($C70,$E$56:$H$67,4,FALSE)","v":{"$error":"#N/A"}}]
["Record error message 3",null,{"$error":"#N/A"},{"$error":"#N/A"},{"$error":"#N/A"},{"$error":"#N/A"},{"$error":"#N/A"}]
["Record error message 4",null,{"$error":"#N/A"},{"$error":"#N/A"},{"$error":"#N/A"},{"$error":"#N/A"},{"$error":"#N/A"}]
["Record error message 5",null,{"$error":"#N/A"},{"$error":"#N/A"},{"$error":"#N/A"},{"$error":"#N/A"},{"$error":"#N/A"}]
["Record error message 6",null,{"$error":"#N/A"},{"$error":"#N/A"},{"$error":"#N/A"},{"$error":"#N/A"},{"$error":"#N/A"}]
["Record error message 7",null,{"$error":"#N/A"},{"$error":"#N/A"},{"$error":"#N/A"},{"$error":"#N/A"},{"$error":"#N/A"}]
["Record error message 8",null,{"$error":"#N/A"},{"$error":"#N/A"},{"$error":"#N/A"},{"$error":"#N/A"},{"$error":"#N/A"}]
["Record error message 9",null,{"$error":"#N/A"},{"$error":"#N/A"},{"$error":"#N/A"},{"$error":"#N/A"},{"$error":"#N/A"}]
["Record error message 10",null,{"$f":"IF(1*RIGHT(A78,2)>$D$68,\"\",INDEX($D$56:$E$67,MATCH(1*RIGHT(A78,2),$D$56:$D$67,0),2))","v":{"$error":"#N/A"}},{"$error":"#N/A"},{"$error":"#N/A"},{"$error":"#N/A"},{"$error":"#N/A"}]
["Record error message 11",null,{"$f":"IF(1*RIGHT(A79,2)>$D$68,\"\",INDEX($D$56:$E$67,MATCH(1*RIGHT(A79,2),$D$56:$D$67,0),2))","v":{"$error":"#N/A"}},{"$error":"#N/A"},{"$error":"#N/A"},{"$error":"#N/A"},{"$error":"#N/A"}]
["Record error message 12",null,{"$f":"IF(1*RIGHT(A80,2)>$D$68,\"\",INDEX($D$56:$E$67,MATCH(1*RIGHT(A80,2),$D$56:$D$67,0),2))","v":{"$error":"#N/A"}},{"$error":"#N/A"},{"$error":"#N/A"},{"$error":"#N/A"},{"$error":"#N/A"}]
["Total records with format changes","FrmRcCt",{"$f":"COUNTIF('Data Entry Worksheet'!R:R,\"Format\")+COUNTIF('Data Entry Worksheet'!R:R,\"Error/Format\")","v":0}]
["Next record requiring auto-format","FrstFrm",{"$f":"IF(AND(ISNA(MATCH(\"Format\",'Data Entry Worksheet'!R:R,0)),ISNA(MATCH(\"Error/Format\",'Data Entry Worksheet'!R:R,0))),\"None\",IF(ISNA(MATCH(\"Format\",'Data Entry Worksheet'!R:R,0)),MATCH(\"Error/Format\",'Data Entry Worksheet'!R:R,0),IF(ISNA(MATCH(\"Error/Format\",'Data Entry Worksheet'!R:R,0)),MATCH(\"Format\",'Data Entry Worksheet'!R:R,0),MIN(MATCH(\"Format\",'Data Entry Worksheet'!R:R,0),MATCH(\"Error/Format\",'Data Entry Worksheet'!R:R,0)))))","v":"None"}]
["Number of format changes in record","FrmCt",{"$f":"IF(C82=\"None\",\"\",COUNTIF(INDIRECT(\"'Data Entry Worksheet'!T\"&C82&\":AX\"&C82),\"CV\"))","v":""}]
["Next address with format change","NxtChg",{"$f":"IF(C82=\"None\",\"\",VLOOKUP(MATCH(\"CV\",INDIRECT(\"'Data Entry Worksheet'!T\"&C$82&\":AX\"&C$82),0),Arrays!$H$68:$J$79,2,FALSE)&C$82)","v":""},null,null,null,{"$f":"AND(C88=8,LEFT('Data Entry Worksheet'!D5,1)=\"0\",LEN('Data Entry Worksheet'!D5)=10,MID('Data Entry Worksheet'!D5,3,1)=\"-\")","v":false}]
["Replace with value in column","NxtRpl",{"$f":"IF(C82=\"None\",\"\",VLOOKUP(MATCH(\"CV\",INDIRECT(\"'Data Entry Worksheet'!T\"&C$82&\":AX\"&C$82),0),Arrays!$H$68:$J$79,3,FALSE)&C$82)","v":""}]
["Reporting entity LBN characters",null,{"$f":"IF(AND(ISERR(FIND(\"*\",'Data Entry Worksheet'!D3)),ISERR(FIND(\"<\",'Data Entry Worksheet'!D3)),ISERR(FIND(\">\",'Data Entry Worksheet'!D3)),ISERR(FIND(\"\\\",'Data Entry Worksheet'!D3)),ISERR(FIND(\"/\",'Data Entry Worksheet'!D3)),ISERR(FIND(\"%\",'Data Entry Worksheet'!D3)),ISERR(FIND(\"^\",'Data Entry Worksheet'!D3)),ISERR(FIND(\"`\",'Data Entry Worksheet'!D3)),ISERR(FIND(\"{\",'Data Entry Worksheet'!D3)),ISERR(FIND(\"}\",'Data Entry Worksheet'!D3)),ISERR(FIND(\"~\",'Data Entry Worksheet'!D3)),ISERR(FIND(\"[\",'Data Entry Worksheet'!D3)),ISERR(FIND(\"]\",'Data Entry Worksheet'!D3)),ISERR(FIND(\"!\",'Data Entry Worksheet'!D3)),ISERR(FIND(\"&\",'Data Entry Worksheet'!D3)),ISERR(FIND(\"+\",'Data Entry Worksheet'!D3)),ISERR(FIND(\"=\",'Data Entry Worksheet'!D3)),ISERR(FIND(\"?\",'Data Entry Worksheet'!D3)),ISERR(FIND(\"#\",'Data Entry Worksheet'!D3)),ISERR(FIND(CHAR(34),'Data Entry Worksheet'!D3))),\"\",\"CV\")","v":""},{"$f":"IF(C86=\"\",\"\",SUBSTITUTE(SUBSTITUTE(SUBSTITUTE(SUBSTITUTE(SUBSTITUTE(SUBSTITUTE(SUBSTITUTE(SUBSTITUTE(SUBSTITUTE(SUBSTITUTE(SUBSTITUTE(SUBSTITUTE(SUBSTITUTE(SUBSTITUTE(SUBSTITUTE(SUBSTITUTE(SUBSTITUTE(SUBSTITUTE(SUBSTITUTE(SUBSTITUTE('Data Entry Worksheet'!D3,\"*\",\"\"),\"<\",\"\"),\">\",\"\"),\"\\\",\"\"),\"/\",\"\"),\"%\",\"\"),\"^\",\"\"),\"`\",\"\"),\"{\",\"\"),\"}\",\"\"),\"~\",\"\"),\"[\",\"\"),\"]\",\"\"),\"!\",\"\"),\"&\",\"\"),\"+\",\"\"),\"=\",\"\"),\"?\",\"\"),\"#\",\"\"),CHAR(34),\"\"))","v":""}]
["Reporting entity LBN length",null,{"$f":"IF(LEN('Data Entry Worksheet'!D3)>150,\"NC\",\"\")","v":""},null,{"$f":"IF(OR(C87=\"\",C87=\"C\"),\"\",COUNTIF(C$87:C87,\"NC\"))","v":""},"  -  Number of characters in Reporting Entity Legal Business Name (LBN) exceeds maximum length of 150 characters."]
["Reporting entity TIN numeric only",null,{"$f":"IF('Data Entry Worksheet'!D5<>\"\",LEN(SUM(MID(0&'Data Entry Worksheet'!D5,LARGE(ISNUMBER(--MID('Data Entry Worksheet'!D5,ROW(INDIRECT(\"1:\"&LEN('Data Entry Worksheet'!D5))),1))* ROW(INDIRECT(\"1:\"&LEN('Data Entry Worksheet'!D5))),ROW(INDIRECT(\"1:\"&LEN('Data Entry Worksheet'!D5))))+1,1)*10^ROW(INDIRECT(\"1:\"&LEN('Data Entry Worksheet'!D5)))/10)),\"\")","v":""}]
["Reporting entity TIN conform",null,{"$f":"IF('Data Entry Worksheet'!D5=\"\",\"\",IF(OR(AND(C88=9,LEN('Data Entry Worksheet'!D5)=10,MID('Data Entry Worksheet'!D5,3,1)=\"-\"),AND(C88=8,LEFT('Data Entry Worksheet'!D5,1)=\"0\",LEN('Data Entry Worksheet'!D5)=10,MID('Data Entry Worksheet'!D5,3,1)=\"-\")),\"C\",IF(OR(AND(C88=9,LEN('Data Entry Worksheet'!D5)=9),AND(C88=8,LEFT('Data Entry Worksheet'!D5,1)=\"0\",LEN('Data Entry Worksheet'!D5)=9)),\"CV\",\"NC\")))","v":""},{"$f":"IF(OR(C89=\"\",C89=\"C\"),\"\",LEFT('Data Entry Worksheet'!D5,2)&\"-\"&RIGHT('Data Entry Worksheet'!D5,7))","v":""},{"$f":"IF(OR(C89=\"\",C89=\"C\"),\"\",COUNTIF(C$87:C89,\"NC\"))","v":""},"  -  The Federal Tax ID Number (TIN) is invalid."]
["Reporting entity payment type conform",null,{"$f":"IF(ISNA(MATCH('Data Entry Worksheet'!D7,Arrays!G81:G82,0)),IF('Data Entry Worksheet'!D7=\"\",\"C\",\"NC\"),\"C\")","v":"C"},null,{"$f":"IF(OR(C90=\"\",C90=\"C\"),\"\",COUNTIF(C$87:C90,\"NC\"))","v":""},"  -  The Payment Type is invalid."]
["Missing RE information",null,{"$f":"IF(OR('Data Entry Worksheet'!D3=\"\",'Data Entry Worksheet'!D5=\"\",'Data Entry Worksheet'!D7=\"\"),1,0)","v":1}]
["Records entered",null,{"$f":"C12-17","v":0}]
["Records complete",null,{"$f":"COUNTIF(INDIRECT(\"'Data Entry Worksheet'!P18:P\"&C12),\"Complete\")","v":0}]
["Monitoring message 1","MonMsg1",{"$f":"\"Total = \"&(C92-C11)&\", Complete = \"&(C93-C11)","v":"Total = 0, Complete = 0"}]
["Enroll monitoring message",null,{"$f":"\"Sum of annual enrollment\"&IF(C2<>\"\",\" (maximum \"&IF(C2=\"Combined Collection\",\"1,587,301.58\",\"1,904,761.90\")&\"):\",\"\")","v":"Sum of annual enrollment"}]
["Filename",null,"Fakename"]
["Annual Enroll exceeds 100% message",null,{"$f":"IF(C3=\"\",\"\",\"You have exceeded 100% of the maximum Annual Enrollment Count. Your count for this form is currently \"&D5&\". The maximum amount for a \"&C2&\" is \"&D3&\".\")","v":""}]
["Missing data CSV validation",null,{"$f":"IF(C97=1,\"There is currently \"&C15&\" record in this Form that contains\", \"There are currently \"&C15&\" records in this Form that contain\")&\" incomplete data. All records must contain information in required fields before you can convert the file to CSV format.\"","v":"There are currently 0 records in this Form that contain incomplete data. All records must contain information in required fields before you can convert the file to CSV format."}]
["Error checking message",null,{"$f":"\"Automatic error checking is currently \"&C14&\".  What would you like to do?\"","v":"Automatic error checking is currently On.  What would you like to do?"}]
["CommandButton1",null,{"$f":"\"Keep error checking \"&C14","v":"Keep error checking On"}]
["CommandButton2",null,{"$f":"\"Turn error checking \"&IF(C14=\"Off\",\"On\",\"Off\")","v":"Turn error checking Off"}]
["Status of attempt to change D10, D12, or D14",null,"No Change"]
["DE Wksht address - VBA-protected cell",null,"A1"]
["VBA-protected cell copy value address",null,"BT14"]
["Record and cell error message Record No","ErrRcMsg",{"$f":"IF(C55=\"\",\"\",\"Record No. \"&C55)","v":"Record No. None"}]
["Total Errors","AllErr",{"$f":"SUMIF(E19:E33,\"E\",C19:C33)","v":0}]
["Last Row with data",null,{"$f":"MAX(IF(ISBLANK('Data Entry Worksheet'!D18:O16746),0,ROW('Data Entry Worksheet'!D18:O16746)))","v":0}]
["CloseMode from file name",null,"continue"]
["Benefit Year header",null,{"$f":"IF(YEAR(TODAY())=2014,\"Benefit Year (2014)\",IF(YEAR(TODAY())=2015,\"Benefit Year (2014, 2015)\",\"Benefit Year (2014-2016)\"))","v":"Benefit Year (2014)"}]
["Filename error status/type",null,{"$f":"IF(LEN(C96)>128, \"LN\",IF(AND(ISERR(FIND(\"*\",C96)),ISERR(FIND(\"<\",C96)),ISERR(FIND(\">\",C96)),ISERR(FIND(\"\\\",C96)),ISERR(FIND(\"/\",C96)),ISERR(FIND(\"%\",C96)),ISERR(FIND(\"^\",C96)),ISERR(FIND(\"`\",C96)),ISERR(FIND(\"{\",C96)),ISERR(FIND(\"}\",C96)),ISERR(FIND(\"~\",C96)),ISERR(FIND(\"[\",C96)),ISERR(FIND(\"]\",C96)),ISERR(FIND(\"!\",C96)),ISERR(FIND(\"&\",C96)),ISERR(FIND(\"+\",C96)),ISERR(FIND(\"=\",C96)),ISERR(FIND(\"?\",C96)),ISERR(FIND(\"#\",C96)),ISERR(FIND(CHAR(34),C96))),\"\",\"SC\"))","v":""}]
["Filename error message",null,{"$f":"IF(C110=\"LN\",\"Filename is invalid.  Filename cannot exceed 128 characters in length.\",IF(C110=\"SC\",\"Filename is invalid.  Filename cannot include special characters.\",\"\"))","v":""}]
["Total RE data errors","REErrCt",{"$f":"COUNTIF(C87:C90,\"NC\")","v":0}]
["RE data error message 1",null,{"$f":"VLOOKUP(1*RIGHT(A113,1),$E$87:$F$90,2,FALSE)","v":{"$error":"#N/A"}}]
["RE data error message 2",null,{"$f":"VLOOKUP(1*RIGHT(A114,1),$E$87:$F$90,2,FALSE)","v":{"$error":"#N/A"}}]
["RE data error message 3",null,{"$error":"#N/A"}]
["Last address","lstaddr","$G$10"]
["Error correction or missing data operation","OpTyp","Error Correction"]
["Row of next record with missing data",null,{"$f":"IF(ISNA(MATCH(1,(INDIRECT(\"'Data Entry Worksheet'!P18:P\"&(C12+1))=\"Incomplete\")*(INDIRECT(\"'Data Entry Worksheet'!S18:S\"&(C12+1))<>\"Ignore\"),0)),\"None\",MATCH(1,(INDIRECT(\"'Data Entry Worksheet'!P18:P\"&(C12+1))=\"Incomplete\")*(INDIRECT(\"'Data Entry Worksheet'!S18:S\"&(C12+1))<>\"Ignore\"),0)+17)","v":"None"},null,{"$f":"IF(ISNA(MATCH(1,(INDIRECT(\"'Data Entry Worksheet'!P18:P20\")=\"Incomplete\")*(INDIRECT(\"'Data Entry Worksheet'!S18:S20\")<>\"Ignore\"),0)),\"\",MATCH(1,(INDIRECT(\"'Data Entry Worksheet'!P18:P20\")=\"Incomplete\")*(INDIRECT(\"'Data Entry Worksheet'!S18:S20\")<>\"Ignore\"),0))","v":""}]
["Missing data type",null,{"$f":"IF(C118=\"None\",\"\",SUBSTITUTE(ADDRESS(1,IF(ISNA(MATCH(TRUE,INDEX(INDIRECT(\"'Data Entry Worksheet'!D\"&C$118&\":G\"&C$118)=\"\",0),0)),MATCH(TRUE,INDEX(INDIRECT(\"'Data Entry Worksheet'!I\"&C$118&\":O\"&C$118)=\"\",0),0)+8,MATCH(TRUE,INDEX(INDIRECT(\"'Data Entry Worksheet'!D\"&C$118&\":G\"&C$118)=\"\",0),0)+3),4),\"1\",\"\"))","v":""}]
["Next address with missing data",null,{"$f":"IF(C118=\"None\",\"\",C119&C118)","v":""}]
["AllMiss",null,{"$f":"IF(C15=1,IF(COUNTA(INDIRECT(\"'Data Entry Worksheet'!D\"&C118&\":G\"&C118))+COUNTA(INDIRECT(\"'Data Entry Worksheet'!I\"&C118&\":O\"&C118))=10,1,2),2)","v":2}]
["Record no. of missing",null,{"$f":"IF(C118=\"None\",\"None\",\"Record No. \"&(C118-17))","v":"None"}]
["Field name",null,{"$f":"INDEX(F56:H67,MATCH(C119,H56:H67,0),1)","v":{"$error":"#N/A"}}]
["Ignore duplicates flag",null,"No"]
["UF28 Label 3 height",null,{"$f":"(F37*12)+12+IF(AND(F34<>0,F35<>0),24,0)","v":12}]
["filenameandpath",null,"C:\\Users\\April\\Documents\\Fakename.csv"]
["new filename",null,{"$f":"LEFT(RIGHT(C126,LEN(C126)-FIND(\"@\",SUBSTITUTE(C126,\"\\\",\"@\",(LEN(C126)-LEN(SUBSTITUTE(C126,\"\\\",\"\")))/LEN(\"\\\")))),LEN(RIGHT(C126,LEN(C126)-FIND(\"@\",SUBSTITUTE(C126,\"\\\",\"@\",(LEN(C126)-LEN(SUBSTITUTE(C126,\"\\\",\"\")))/LEN(\"\\\")))))-4)","v":"Fakename"}]
["new filename error type",null,{"$f":"IF(LEN(C127)>128, \"LN\",IF(AND(ISERR(FIND(\"*\",C127)),ISERR(FIND(\"<\",C127)),ISERR(FIND(\">\",C127)),ISERR(FIND(\"\\\",C127)),ISERR(FIND(\"/\",C127)),ISERR(FIND(\"%\",C127)),ISERR(FIND(\"^\",C127)),ISERR(FIND(\"`\",C127)),ISERR(FIND(\"{\",C127)),ISERR(FIND(\"}\",C127)),ISERR(FIND(\"~\",C127)),ISERR(FIND(\"[\",C127)),ISERR(FIND(\"]\",C127)),ISERR(FIND(\"!\",C127)),ISERR(FIND(\"&\",C127)),ISERR(FIND(\"+\",C127)),ISERR(FIND(\"=\",C127)),ISERR(FIND(\"?\",C127)),ISERR(FIND(\"#\",C127)),ISERR(FIND(CHAR(34),C127))),\"\",\"SC\"))","v":""}]
["new filename error message",null,{"$f":"IF(C128=\"LN\",\"Filename is invalid.  Filename cannot exceed 128 characters in length.\",IF(C128=\"SC\",\"Filename is invalid.  Filename cannot include special characters.\",\"\"))","v":""}]

{"sheet":"Arrays","index":2,"n_rows":123,"n_cols":15,"rows_kept":123,"cut":false,"hidden":true,"merged":[]}
[null,null,null,null,null,null,"States",null,"ZIPs with 2 starting 0s",null,null,null,"ZIPs with 1 starting 0"]
[]
[null,null,null,null,null,null,"AL","Alabama","NY","New York",5,null,"MA","Massachusetts",1]
[null,null,null,null,null,null,"AK","Alaska","PR","Puerto Rico",6,null,"MA","Massachusetts",2]
["Application Level",null,null,null,null,null,"AZ","Arizona","PR","Puerto Rico",7,null,"MA","Massachusetts",5]
[null,null,null,null,null,null,"AR","Arkansas","PR","Puerto Rico",9,null,"RI","Rhode Island",2]
["Error description","Field","Cell address",null,null,null,"CA","California","VI","Virgin Islands",8,null,"NH","New Hampshire",3]
["Blank row","N/A","Row 23",null,null,null,"CO","Colorado",null,null,null,null,"ME","Maine",3]
["Information missing from required field","State","Cell H40",null,null,null,"CT","Connecticut",null,null,null,null,"ME","Maine",4]
[null,null,null,null,null,null,"DE","Delaware",null,null,null,null,"VT","Vermont",5]
["Field Level Errors",null,null,null,null,null,"DC","District of Columbia",null,null,null,null,"CT","Connecticut",6]
[null,null,null,null,null,null,"FL","Florida",null,null,null,null,"NJ","New Jersey",7]
["Error description","Field","Cell address",null,null,null,"GA","Georgia",null,null,null,null,"NJ","New Jersey",8]
["Data entered does not conform to range of acceptable values","Contributing entity Federal Tax ID","Cell C24",null,null,null,"HI","Hawaii"]
["Data entered does not conform to range of acceptable values","Contributing entity organization type","Cell E36",null,null,null,"ID","Idaho"]
["Data entered does not conform to range of acceptable values","Contributing entity billing address: ZIP code","Cell I48",null,null,null,"IL","Illinois"]
["Data entered does not conform to range of acceptable values","Benefit year","Cell K60",null,null,null,"IN","Indiana"]
["Data entered does not conform to range of acceptable values","Enrollment count","Cell L72",null,null,null,"IA","Iowa"]
[null,null,null,null,null,null,"KS","Kansas"]
[null,null,null,null,null,null,"KY","Kentucky"]
["Field Level Exceptions",null,null,null,null,null,"LA","Louisiana"]
[null,null,null,null,null,null,"ME","Maine"]
["Exception description","Field","Cell address",null,null,null,"MD","Maryland"]
["Data entered exceeds maximum field length","Contributing entity legal business name","Cell B24",null,null,null,"MA","Massachusetts"]
["Data entered includes unallowed special characters","Contributing entity legal business name","Cell B36",null,null,null,"MI","Michigan"]
["Federal Tax ID may be missing a hyphen","Contributing entity Federal Tax ID","Cell C48",null,null,null,"MN","Minnesota"]
["Federal Tax ID may be missing a leading zero","Contributing entity Federal Tax ID","Cell C60",null,null,null,"MS","Mississippi"]
[null,null,null,null,null,null,"MO","Missouri"]
["Notifications",null,null,null,null,null,"MT","Montana"]
[null,null,null,null,null,null,"NE","Nebraska"]
["Notification description","Field","Cell address",null,null,null,"NV","Nevada"]
["Value will be converted during CSV file creation","Contributing entity organization type","Cell C24",null,null,null,"NH","New Hampshire"]
["Value will be converted during CSV file creation","Contributing entity billing address: state","Cell H36",null,null,null,"NJ","New Jersey"]
["Value will be converted during CSV file creation","Enrollment count","Cell L48",null,null,null,"NM","New Mexico"]
[null,null,null,null,null,null,"NY","New York"]
["Empty Rows",null,null,null,null,null,"NC","North Carolina"]
[12,null,null,null,null,null,"ND","North Dakota"]
[24,null,null,null,null,null,"OH","Ohio"]
[36,null,null,null,null,null,"OK","Oklahoma"]
[48,null,null,null,null,null,"OR","Oregon"]
[60,null,null,null,null,null,"PA","Pennsylvania"]
[72,null,null,null,null,null,"RI","Rhode Island"]
[null,null,null,null,null,null,"SC","South Carolina"]
["Dup Rows",null,null,null,null,null,"SD","South Dakota"]
["Contributing Entity Name","Contributing Entity TIN",null,null,null,null,"TN","Tennessee"]
["Contributing Entity 1","22-2222222",null,null,null,null,"TX","Texas"]
["Contributing Entity 2","33-3333333",null,null,null,null,"UT","Utah"]
["Contributing Entity 3","44-4444444",null,null,null,null,"VT","Vermont"]
["Contributing Entity 4","55-5555555",null,null,null,null,"VA","Virginia"]
[null,null,null,null,null,null,"WA","Washington"]
["Special Characters",null,null,null,null,null,"WV","West Virginia"]
["Record","Contributing Entity Name","Contributing Entity TIN","Field with Special Character","Cell Address",null,"WI","Wisconsin"]
[32,"Contributing Entity 1","22-2222222","Billing address line 1",{"$f":"\"E\"&17+A53","v":"E49"},null,"WY","Wyoming"]
[68,"Contributing Entity 2","33-3333333","Legal business name",{"$f":"\"B\"&17+A54","v":"B85"},null,"AS","American Samoa"]
[105,"Contributing Entity 3","44-4444444","Legal business name",{"$f":"\"B\"&17+A55","v":"B122"},null,"GU","Guam"]
[221,"Contributing Entity 4","55-5555555","Billing address city",{"$f":"\"H\"&17+A56","v":"H238"},null,"MP","Northern Mariana Islands"]
[null,null,null,null,null,null,"PR","Puerto Rico"]
["Field Length",null,null,null,null,null,"VI","Virgin Islands"]
["Record","Contributing Entity Name","Contributing Entity TIN","Field Exceeding Length","Cell Address"]
[32,"Contributing Entity 1","22-2222222","Billing address line 1",{"$f":"\"E\"&17+A60","v":"E49"},null,"HII","Health Insurance Issuer ",{"$f":"H60&\" (\"&G60&\")\"","v":"Health Insurance Issuer  (HII)"}]
[68,"Contributing Entity 2","33-3333333","Legal business name",{"$f":"\"B\"&17+A61","v":"B85"},null,"SI","Self-Insured",{"$f":"H61&\" (\"&G61&\")\"","v":"Self-Insured (SI)"}]
[105,"Contributing Entity 3","44-4444444","Legal business name",{"$f":"\"B\"&17+A62","v":"B122"},null,"SISA","Self-Insured and Self-Administered","Self-Insured and Self-Administered (SISA)"]
[221,"Contributing Entity 4","55-5555555","Billing address city",{"$f":"\"H\"&17+A63","v":"H238"},null,"MGHPS","Multiple Group Health Plan (single plan treatment)","Multiple Group Health Plan (single plan treatment) (MGHPS)"]
[null,null,null,null,null,null,"MGHPM","Multiple Group Health Plan (multiple plan treatment)","Multiple Group Health Plan (multiple plan treatment) (MGHPM)"]
["TIN Non-conforming",null,null,null,null,null,"OTHER","Other type","Other type (OTHER)"]
["Record","Contributing Entity Name","Contributing Entity TIN","Type of error","Cell Address"]
[32,"Contributing Entity 1","78-1234567","Leading characters not valid",{"$f":"\"C\"&17+A67","v":"C49"},null,"Format issue","Format Col","Orig Col","Replace Col"]
[68,"Contributing Entity 2","TY-345","Entry includes non-numeric characters",{"$f":"\"C\"&17+A68","v":"C85"},null,"Special Characters/LBN",{"$f":"COLUMN('Data Entry Worksheet'!T:T)-COLUMN('Data Entry Worksheet'!S:S)","v":1},{"$f":"SUBSTITUTE(ADDRESS(1,COLUMN('Data Entry Worksheet'!D:D),4),\"1\",\"\")","v":"D"},{"$f":"SUBSTITUTE(ADDRESS(1,COLUMN('Data Entry Worksheet'!U:U),4),\"1\",\"\")","v":"U"}]
[105,"Contributing Entity 3","6155446","Entry contains too few numbers",{"$f":"\"C\"&17+A69","v":"C122"},null,"TIN to have hyphen added",{"$f":"COLUMN('Data Entry Worksheet'!X:X)-COLUMN('Data Entry Worksheet'!S:S)","v":5},{"$f":"SUBSTITUTE(ADDRESS(1,COLUMN('Data Entry Worksheet'!E:E),4),\"1\",\"\")","v":"E"},{"$f":"SUBSTITUTE(ADDRESS(1,COLUMN('Data Entry Worksheet'!Y:Y),4),\"1\",\"\")","v":"Y"}]
[221,"Contributing Entity 4","61-12345678","Entry contains too many numbers",{"$f":"\"C\"&17+A70","v":"C238"},null,"Org Type capitalization",7,"F","AS"]
[230,"Contributing Entity 5","555-55-5555","Hypen(s) placed incorrectly",{"$f":"\"C\"&17+A71","v":"C247"},null,"Special Characters/Addr1",{"$f":"COLUMN('Data Entry Worksheet'!AA:AA)-COLUMN('Data Entry Worksheet'!S:S)","v":8},{"$f":"SUBSTITUTE(ADDRESS(1,COLUMN('Data Entry Worksheet'!G:G),4),\"1\",\"\")","v":"G"},{"$f":"SUBSTITUTE(ADDRESS(1,COLUMN('Data Entry Worksheet'!AB:AB),4),\"1\",\"\")","v":"AB"}]
[null,null,null,null,null,null,"Special Characters/Addr2",{"$f":"COLUMN('Data Entry Worksheet'!AD:AD)-COLUMN('Data Entry Worksheet'!S:S)","v":11},{"$f":"SUBSTITUTE(ADDRESS(1,COLUMN('Data Entry Worksheet'!H:H),4),\"1\",\"\")","v":"H"},{"$f":"SUBSTITUTE(ADDRESS(1,COLUMN('Data Entry Worksheet'!AE:AE),4),\"1\",\"\")","v":"AE"}]
["TIN Potentially Conforming",null,null,null,null,null,"Special Characters/City",{"$f":"COLUMN('Data Entry Worksheet'!AG:AG)-COLUMN('Data Entry Worksheet'!S:S)","v":14},{"$f":"SUBSTITUTE(ADDRESS(1,COLUMN('Data Entry Worksheet'!I:I),4),\"1\",\"\")","v":"I"},{"$f":"SUBSTITUTE(ADDRESS(1,COLUMN('Data Entry Worksheet'!AH:AH),4),\"1\",\"\")","v":"AH"}]
["Record","Contributing Entity Name","Contributing Entity TIN","Suggested change","Cell Address",null,"Bill State to be converted",{"$f":"COLUMN('Data Entry Worksheet'!AJ:AJ)-COLUMN('Data Entry Worksheet'!S:S)","v":17},{"$f":"SUBSTITUTE(ADDRESS(1,COLUMN('Data Entry Worksheet'!J:J),4),\"1\",\"\")","v":"J"},{"$f":"SUBSTITUTE(ADDRESS(1,COLUMN('Data Entry Worksheet'!AK:AK),4),\"1\",\"\")","v":"AK"}]
[32,"Contributing Entity 1","12345678","01-2345678",{"$f":"\"C\"&17+A75","v":"C49"},null,"ZIP to have hyphen added",{"$f":"COLUMN('Data Entry Worksheet'!AM:AM)-COLUMN('Data Entry Worksheet'!S:S)","v":20},{"$f":"SUBSTITUTE(ADDRESS(1,COLUMN('Data Entry Worksheet'!K:K),4),\"1\",\"\")","v":"K"},{"$f":"SUBSTITUTE(ADDRESS(1,COLUMN('Data Entry Worksheet'!AO:AO),4),\"1\",\"\")","v":"AO"}]
[68,"Contributing Entity 2","123456789","12-3456789",{"$f":"\"C\"&17+A76","v":"C85"},null,"ZIP convert to text",{"$f":"COLUMN('Data Entry Worksheet'!AN:AN)-COLUMN('Data Entry Worksheet'!S:S)","v":21},{"$f":"SUBSTITUTE(ADDRESS(1,COLUMN('Data Entry Worksheet'!K:K),4),\"1\",\"\")","v":"K"},{"$f":"SUBSTITUTE(ADDRESS(1,COLUMN('Data Entry Worksheet'!AO:AO),4),\"1\",\"\")","v":"AO"}]
[null,null,null,null,null,null,"Dom State to be converted",{"$f":"COLUMN('Data Entry Worksheet'!AP:AP)-COLUMN('Data Entry Worksheet'!S:S)","v":23},{"$f":"SUBSTITUTE(ADDRESS(1,COLUMN('Data Entry Worksheet'!L:L),4),\"1\",\"\")","v":"L"},{"$f":"SUBSTITUTE(ADDRESS(1,COLUMN('Data Entry Worksheet'!AQ:AQ),4),\"1\",\"\")","v":"AQ"}]
["Org Type Non-conforming",null,null,null,null,null,"Benefit year convert to text",{"$f":"COLUMN('Data Entry Worksheet'!AS:AS)-COLUMN('Data Entry Worksheet'!S:S)","v":26},{"$f":"SUBSTITUTE(ADDRESS(1,COLUMN('Data Entry Worksheet'!M:M),4),\"1\",\"\")","v":"M"},{"$f":"SUBSTITUTE(ADDRESS(1,COLUMN('Data Entry Worksheet'!AT:AT),4),\"1\",\"\")","v":"AT"}]
["Record","Contributing Entity Name","Contributing Entity TIN","Entered Organization Type","Cell Address",null,"Entity Type capitalize",{"$f":"COLUMN('Data Entry Worksheet'!AW:AW)-COLUMN('Data Entry Worksheet'!S:S)","v":30},{"$f":"SUBSTITUTE(ADDRESS(1,COLUMN('Data Entry Worksheet'!O:O),4),\"1\",\"\")","v":"O"},{"$f":"SUBSTITUTE(ADDRESS(1,COLUMN('Data Entry Worksheet'!AX:AX),4),\"1\",\"\")","v":"AX"}]
[32,"Contributing Entity 1","22-2222222","Private",{"$f":"\"C\"&17+A80","v":"C49"}]
[68,"Contributing Entity 2","33-3333333","NGO",{"$f":"\"C\"&17+A81","v":"C85"},null,"Combined Collection",1587301.58]
[null,null,null,null,null,null,"Two-Part Collection",1904761.9,null,{"$f":"IF(I82=0,\"\",\"Format\")","v":""}]
["Org Type Potentially Conforming"]
["Record","Contributing Entity Name","Contributing Entity TIN","Entered Organization Type","Cell Address",null,"A1","Transitional Reinsurance Program Supporting Documentation Job Aid","$A$2"]
[32,"Contributing Entity 1","22-2222222","Not-for-Profit",{"$f":"\"C\"&17+A85","v":"C49"},null,"A2","Reporting Entity Information:","$A$9"]
[68,"Contributing Entity 2","33-3333333","Non-profit",{"$f":"\"C\"&17+A86","v":"C85"},null,"B3","Legal Business Name"]
[null,null,null,null,null,null,"B5","Federal Tax ID Number"]
["ZIP Non-conforming",null,null,null,null,null,"B7","Type of Payment"]
["Record","Contributing Entity Name","Contributing Entity TIN","Entered ZIP Code","Type of error","Cell Address","A9","Data entry status:"]
[32,"Contributing Entity 1","22-2222222","TY777","Entry includes non-numeric characters",{"$f":"\"C\"&17+A90","v":"C49"},"B10","Records entered:"]
[68,"Contributing Entity 2","33-3333333","564","Entry contains too few numbers",{"$f":"\"C\"&17+A91","v":"C85"},"B12"]
[105,"Contributing Entity 3","6155446","564444","Entry contains too many numbers",{"$f":"\"C\"&17+A92","v":"C122"},"B14","File size (maximum 2 megabytes):"]
[221,"Contributing Entity 4","61-12345678","1234-56789","Hypen(s) placed incorrectly",{"$f":"\"C\"&17+A93","v":"C238"},"D10"]
[null,null,null,null,null,null,"D12"]
["ZIP Potentially Conforming",null,null,null,null,null,"D14"]
["Record","Contributing Entity Name","Contributing Entity TIN","Entered ZIP Code","Suggested change","Cell Address"]
[32,"Contributing Entity 1","22-2222222","1234","01234",{"$f":"\"C\"&17+A97","v":"C49"},2014]
[68,"Contributing Entity 2","33-3333333","123456789","12345-6789",{"$f":"\"C\"&17+A98","v":"C85"},{"$f":"IF(YEAR(TODAY())>=2015,2015,\"\")","v":""}]
[null,null,null,null,null,null,{"$f":"IF(YEAR(TODAY())=2016,2016,\"\")","v":""}]
["State Non-conforming",null,null,null,null,null,"Active","If Last","Select"]
["Record","Contributing Entity Name","Contributing Entity TIN","Entered Address: State","Cell Address",null,"$G$10","$D$10","$D$12","okay"]
[32,"Contributing Entity 1","22-2222222","Mass",{"$f":"\"C\"&17+A102","v":"C49"},null,"$B$12","$G$10","$G$12","okay"]
[68,"Contributing Entity 2","33-3333333","Gbgbb",{"$f":"\"C\"&17+A103","v":"C85"},null,"$G$12","$D$12","$G$10","okay"]
[null,null,null,null,null,null,"$D$12","$G$12","$G$10","okay"]
["State Potentially Conforming",null,null,null,null,null,"$D$10","$G$10","$D$12","okay"]
["Record","Contributing Entity Name","Contributing Entity TIN","Entered Address: State","Suggested change","Cell Address","$G$10","$B$12","$D$10","loop"]
[32,"Contributing Entity 1","22-2222222","Massachusetts","MA",{"$f":"\"C\"&17+A107","v":"C49"}]
[68,"Contributing Entity 2","33-3333333","Maryland","MD",{"$f":"\"C\"&17+A108","v":"C85"}]
[]
["Ben Year Non-conforming"]
["Record","Contributing Entity Name","Contributing Entity TIN","Entered Benefit Year","Cell Address"]
[32,"Contributing Entity 1","22-2222222","014",{"$f":"\"C\"&17+A112","v":"C49"}]
[68,"Contributing Entity 2","33-3333333","2020",{"$f":"\"C\"&17+A113","v":"C85"}]
[]
["Entity Type Non-conforming"]
["Record","Contributing Entity Name","Contributing Entity TIN","Entered Entity Type","Cell Address"]
[32,"Contributing Entity 1","22-2222222","Private",{"$f":"\"C\"&17+A117","v":"C49"}]
[68,"Contributing Entity 2","33-3333333","NGO",{"$f":"\"C\"&17+A118","v":"C85"}]
[]
["Entity Type Potentially Conforming"]
["Record","Contributing Entity Name","Contributing Entity TIN","Entered Entity Type","Suggested change","Cell Address"]
[32,"Contributing Entity 1","22-2222222","Health Insurance Issuer","HII",{"$f":"\"C\"&17+A122","v":"C49"}]
[68,"Contributing Entity 2","33-3333333","Self-Insured","SI",{"$f":"\"C\"&17+A123","v":"C85"}]

{"sheet":"UFs","index":3,"n_rows":38,"n_cols":13,"rows_kept":38,"cut":false,"hidden":true,"merged":[]}
[]
[null,null,null,null,null,"Functions",null,null,null,null,"Range Refs"]
["Source","Purpose","Type","Launched from","Calls","Sheet Protect","CutCopyMode","Screen Update","QueryClose","Error Capture","Work Range","Data Entry","Code"]
["Sheet 1",null,null,null,null,null,"Yes",null,"NA","Yes"]
["UF1","RE information missing","Notice and Data Entry","Sheet 1, UF33, UF34","None",null,null,null,"Yes","Yes",null,"D3, D5, D7"]
[{"$f":"\"UF\"&RIGHT(A5,1)+1","v":"UF2"},"Error Correction/Missing Data - Non-specific",null,null,null,null,null,null,"Yes","Yes"]
[{"$f":"\"UF\"&RIGHT(A6,1)+1","v":"UF3"},"Reporting entity LBN too long","Error","Sheet 1",null,null,null,null,"Yes","NA",null,"D3"]
["UF4","Blank row warning","Error","Sheet 1, UF33, UF34","None","Protect/Unprotect, Copy",null,null,"Yes","Yes",null,"Variable","C11-C13"]
["UF5","Cell protection message","Protected Cell","Sheet 1","None","No","No","No","Yes","NA","No","None","None"]
["UF6","Incomplete records warning - auto-error check","Notice","Sheet 1, UF33, UF34","UF7","Protect/Unprotect, Copy",null,null,"Yes","Yes",null,"Svar","C12, C16"]
["UF7","User information for finding incomplete records","Notice","UF6, UF14","None","None",null,null,"Yes","NA",null,"None","None"]
["UF8","Duplicate CE TINs","Error","Sheet 1, UF33, UF34",null,"Protect/Unprotect, Copy",null,null,"Yes","Yes",null,"Qvar","C12, C17"]
["UF9","Special characters will be removed from RE LBN field","Notice","Sheet 1",null,null,null,null,"Yes","Yes",null,"D3","D86"]
["UF10","Invalid value in RE payment type field","Error","Sheet 1","None",null,null,null,"Yes","NA",null,"D7"]
[{"$f":"\"UF\"&RIGHT(A14,2)+1","v":"UF11"},"Invalid RE tax ID","Error","Sheet 1","None",null,null,null,"Yes","NA",null,"D5"]
[{"$f":"\"UF\"&RIGHT(A15,2)+1","v":"UF12"},"RE TIN missing a hyphen","Notice","Sheet 1",null,"CutCopyMode",null,null,"Yes","Yes",null,"D5, BT13"]
["UF13","Specify CSV file name","Data Entry","UF34",null,null,null,null,"Yes","NA",null,null,"C96"]
["UF14","Incomplete records - pre-CSV validation check","Error","UF34","UF7",null,null,null,"Yes","Yes",null,null,"C98"]
["UF15","No Used",null,null,null,null,null,null,"NA","NA"]
["UF16","CSV file creation discontinued bc user cancelled",null,null,null,null,null,null,"Yes","NA"]
["UF17","CSV file creation discontinued bc file exceeds 2 MB",null,null,null,null,null,null,"Yes","NA"]
["UF18","CSV file creation discontinued bc filename invalid",null,null,null,null,null,null,"Yes","NA"]
["UF19","RE data validation results and data entry",null,null,null,null,null,null,"Yes","Yes"]
["UF20","Post-validation \"Errors and/or Missing Values Remain\" message",null,null,null,null,null,null,"Yes","NA"]
["UF21","Data validation complete - no errors or missing data",null,null,null,null,null,null,"Yes","NA"]
["UF22","Error Correction/Missing Data - Org Type",null,null,null,null,null,null,"Yes","Yes"]
["UF23","Error Correction/Missing Data - State",null,null,null,null,null,null,"Yes","Yes"]
["UF24","Error Correction/Missing Data - Benefit Year",null,null,null,null,null,null,"Yes","Yes"]
["UF25","Error Correction/Missing Data - Ent Type",null,null,null,null,null,null,"Yes","Yes"]
["UF26","Enrollment count 75% and 90% flag","Notice","Sheet 1",null,null,null,null,"Yes","NA",null,null,"C10"]
["UF27","Notice re: where to find duplicate values for manual deletion","Notice",null,null,null,null,null,"Yes","NA"]
["UF28","List of formatting issues and errors","Summary of Errors and Warnings","Sheet 1, UF33, UF34","UF29","Paste",null,null,"Yes","Yes",null,"Multiple, variable rows","C54, C81-C85, D39-D53, F37, G38-G53, "]
["UF29","Error Correction list","Error Correction (Click and Drag to Move Window)","UF28",null,null,null,null,"Yes","Yes",null,"Dvar","C54, C55, C69-C80, D68"]
["UF30","Enrollment count exceeds 100%","Error","Sheet 1, UF33, UF34",null,null,null,null,null,"NA",null,null,"C97"]
["UF31","CSV file creation discontinued","Notice","UF34","None","None",null,null,null,"NA",null,"None"]
["UF32","Error on/off toggle","User Input","Sheet 1",null,null,null,null,null,"Yes",null,"G10","C14, C99-C101"]
["UF33","Run manual validation check","User Input","Sheet 1","UF1, UF4, UF6, UF8, UF28, UF30","Protect/Unprotect",null,null,"Yes","Yes",null,"S:S","C7, C11, C15, C17, C91, F36"]
["UF34","Create CSV file","User Input","Sheet 1","UF1, UF4, UF6, UF8, UF13, UF14, UF28, UF30, UF31","ScreenUpdating",null,null,"Yes","Yes",null,"multiple/variable, S:S","C7, C11, C15, C17, C91, C96, F36"]

{"sheet":"Start Message","index":4,"n_rows":9,"n_cols":2,"rows_kept":9,"cut":false,"hidden":false,"merged":[]}
["Transitional Reinsurance Program Supporting Documentation Job Aid"]
[]
[null,"If you are seeing this sheet, it means that macros are not enabled.  MS Excel requires that you confirm the source of the Excel file by explicitly enabling macros to prevent users from inadvertently downloading harmful Excel files from unknown sources.  For the Job Aid to work correctly, you must enable macros.  Please follow the instructions presented below. "]
[]
[null,"For Excel 2007:"]
[null,"1. Set/confirm the global macro security setting for your computer: click the Office Button and select \"Excel Option\" then \"Trust Center\" then \"Trust Center Settings\" then \"Macro Settings.\"  Select \"Disable all macros with notifications.\"\n2. Enable macros for the Job Aid: click the \"Option\" button and select \"Enable this content.\""]
[]
[null,"For Excel 2010:"]
[null,"If you see the \"Security Warning in the yellow banner at the top of your screen, click on the button \"Enable Content.\n\nYou can also establish a \"Trusted Location that will allow you to continue to work with the Job Aid by enabling macros for all files in the defined location.  To establish a Trusted Location:\n\n1. Set/confirm the global macro security setting for your computer: click the \"File\" tab (upper left corner) and select \"Options\" then \"Trust Center\" then \"Trust Center Settings\" then \"Macro Settings.\"  Select \"Disable all macros with notifications.\" \n2. Enable macros for the Job Aid by setting up a \"Trusted Location\" on your computer where the Job Aid will be run: from the \"Trust Center Settings\" screen, click \"Trusted Locations\" then \"Add New Location.\"  \"Browse\" to the path where you plan to store and run the Job Aid and click \"OK.\" \n\nNote that this procedure will identify the folder as a “trusted location.”  Any spreadsheet stored in the folder will be macro-enabled.  You do not need to identify specific spreadsheets within the folder as macro-enabled, and you will not be able to limit this macro-enabled status to specific spreadsheets.  Therefore, you should not store macro-enabled spreadsheets of unknown origin in this folder. "]