{"text_format":"1","workbook":"xlsx","n_sheets":14,"sheets":["Line Item Diabetes","Line Item Maternity","Color Key","Starting Screen","Manual Entry","Automated Import","Diabetes Timeline","Maternity Timeline","Manual Results","Automated Results","Orig Scenario","Import","Import Entry","Import Results"],"not_rendered":{"charts":0,"images":0,"macros":1,"external_links":0,"defined_names":247,"comments":0,"pivot_tables":0},"unopened":[],"bounds":{"document_bytes":16777216,"sheet_cells":100000,"rows_first":2000,"rows_last":500,"rows_between":2000,"halvings":0,"cell_chars":16384,"cell_head_chars":4096},"cells_cut":0,"cells_raw":0,"read":"whole","date_system":"1900"}

{"sheet":"Line Item Diabetes","index":0,"n_rows":31,"n_cols":8,"rows_kept":31,"cut":false,"hidden":true,"merged":[]}
["Unique\nKey","Diagnosis Code \n(ICD-9)","CPT©, HCPCS, or\nOther Billing Code","Provider\nType","Category"," Descriptor","Allowed\nAmount","Notes"]
[1,"250.00, V58.66, V58.67",2803101,"Pharmacy Retail","Pharmacy","Glucagon Emergency Kit",153]
[2,"250.00, V58.66, V58.67",36415,"Primary","Laboratory tests","Routine Venipuncture",4.1312550556999996]
[3,"250.00, V58.66, V58.67","53885014201","Pharmacy Retail","Medical equipment and supplies","OneTouch Delica Lancing Device ",18]
[4,"250.00, V58.66, V58.67",53885024510,"Pharmacy Retail","Medical equipment and supplies","OneTouch Ultra Blue Test Strips (Rx - box of 100) [usage = 2 strips/day; 60 per month] ",123.6]
[5,"250.00, V58.66, V58.67",53885039310,"Pharmacy Retail","Medical equipment and supplies","OneTouch Delica Lancets (100 per box)  [usage = 60 lancets per month]",9]
[6,"250.00, V58.66, V58.67","53885041601","Pharmacy Retail","Medical equipment and supplies","OneTouch Ultra Control Solution (2 vials/box)",6.02]
[7,"250.00, V58.66, V58.67",53885044801,"Pharmacy Retail","Medical equipment and supplies","OneTouch Ultra 2 Blood Glucose Meter Kit",66]
[8,"250.00, V58.66, V58.67",80053,"Primary","Laboratory tests","Comprehen Metabolic Panel",18.130348149]
[9,"250.00, V58.66, V58.67",80061,"Primary","Laboratory tests","Lipid panel",19.234491976000001]
{"$rows_left_out":22}
{"sheet":"Line Item Maternity","index":1,"n_rows":37,"n_cols":8,"rows_kept":37,"cut":false,"hidden":true,"merged":[]}
["Unique\nKey","Diagnosis Code \n(ICD-9)","CPT©, HCPCS, or\nOther Billing Code","Provider\nType","Category"," Descriptor","Allowed\nAmount","Notes"]
[1,null,378710401,"Pharmacy Retail","Pharmacy","Oxycodone/APAP 5mg/325mg (Rx) [1 pill Q6H PRN; 15 pills]",5.21]
[2,null,591346601,"Pharmacy Retail","Pharmacy","Ibuprofen 800mg (Rx) [1 pill Q8H PRN; 60 pills]",17.52]
[3,"650, V27.0","S9443","Inpatient Facility","Education","Lactation class",0,"Included in hospital rate**"]
[4,"650, V27.0, Proc: 73.59","**(DRG) 795","Inpatient Facility","Hospital charges (baby)","Normal newborn",851.56]
[5,"650, V27.0, Proc: 73.59",1967,"Anesthesiology","Anesthesia","Anesth/analg vag delivery",905.62]
[6,"650, V27.0, Proc: 73.59","Bundled in global OB package - 59400","OBGYN","Routine Obstetric Care","Obstetrical Care",2084.2829046000002,"59400 - Global OB package description/code"]
[7,null,"OTC","Pharmacy Retail","Pharmacy","Docusate sodium (OTC) [1 pill QD]",30]
[8,null,"OTC","Pharmacy Retail","Pharmacy","Prenatal Vitamins (OTC - Bottle of 100) [1 pill daily; 30 pills/month]",30]
[9,null,"S9442","Alternative Provider","Education","Birthing class",0]
{"$rows_left_out":28}
{"sheet":"Color Key","index":2,"n_rows":9,"n_cols":3,"rows_kept":9,"cut":false,"hidden":true,"merged":[]}
[]
[]
[null,null,"= Input Data provided by Insurer"]
[]
[]
[null,null,"= Scenario data provided by HHS"]
[]
[]
[null,"Formula","= Derived from formula"]

{"sheet":"Starting Screen","index":3,"n_rows":19,"n_cols":9,"rows_kept":19,"cut":false,"hidden":false,"merged":[[0,1,0,3],[10,3,11,3],[18,8,18,10]]}
[]
[null,"    Welcome to the Coverage Scenarios Cost Sharing Calculator"]
[]
[]
[]
[null,"All insurer data entry fields will be highlighted in orange:"]
[]
[null,"There are two methods to use this tool:"]
[]
[]
{"$rows_left_out":10}
{"sheet":"Manual Entry","index":4,"n_rows":28,"n_cols":16,"rows_kept":28,"cut":false,"hidden":true,"merged":[[0,11,1,11]]}
[null,"MANUAL ENTRY INSTRUCTIONS",null,null,null,null,null,null,null,null,null,"Switch to:"]
[null,"Fill in the coverage details for one plan in the orange cells using numbers only."]
[null,"If the category is not covered or included in the plan, leave the cell blank."]
[null,"Click the 'Run the Calculator' button to compute the cost sharing for the scenarios."]
[]
[null,null,null,null,null,null,null,null,null,"Selection",null,"$ OR %",{"$f":"COUNTIF(M7:M14,\"Please enter a value\")+COUNTIF(M7:M14,\"Please correct\")","v":0},"rngShare Type","rngPlanDeduct","Cost_Sharing_List_4"]
[{"$f":"Share_DME","v":"No Cost Sharing"},null,"COST SHARING",null,"Durable Medical Equipment",null,null,null,null,{"$f":"INDEX(Cost_Sharing_List_4,K7)","v":"No Cost Sharing"},3,"",{"$f":"IF(AND(OR(Share_DME=\"Coinsurance\",Share_DME=\"Copayment\"),Value_DME=\"\"),\"Please enter a value\",IF(OR(AND(Share_DME=\"Coinsurance\",Value_DME>1),AND(Value_DME<>\"\",OR(Share_DME=\"Not Covered\",Share_DME=\"No Cost Sharing\"))),\"Please correct\",\"\"))","v":""},"rngShareValue","rngPlanLimit","Copayment"]
[{"$f":"Share_RX","v":"Copayment"},null,null,null,"Generic Prescriptions",null,null,null,null,{"$f":"INDEX(Cost_Sharing_List_4,K8)","v":"Copayment"},1,10,{"$f":"IF(AND(OR(Share_RX=\"Coinsurance\",Share_RX=\"Copayment\"),Value_RX=\"\"),\"Please enter a value\",IF(OR(AND(Share_RX=\"Coinsurance\",Value_RX>1),AND(Value_RX<>\"\",OR(Share_RX=\"Not Covered\",Share_RX=\"No Cost Sharing\"))),\"Please correct\",\"\"))","v":""},null,null,"Coinsurance"]
[{"$f":"Share_Hospital","v":"Coinsurance"},null,null,null,"Hospital Care, Inpatient & Anesthesia",null,null,null,null,{"$f":"INDEX(Cost_Sharing_List_4,K9)","v":"Coinsurance"},2,0.3,{"$f":"IF(AND(OR(Share_Hospital=\"Coinsurance\",Share_Hospital=\"Copayment\"),Value_Hospital=\"\"),\"Please enter a value\",IF(OR(AND(Share_Hospital=\"Coinsurance\",Value_Hospital>1),AND(Value_Hospital<>\"\",OR(Share_Hospital=\"Not Covered\",Share_Hospital=\"No Cost Sharing\"))),\"Please correct\",\"\"))","v":""},"Manual_Scenario:","Dia","No Cost Sharing"]
[{"$f":"Share_Lab","v":"No Cost Sharing"},null,null,null,"Laboratory",null,null,null,null,{"$f":"INDEX(Cost_Sharing_List_4,K10)","v":"No Cost Sharing"},3,"",{"$f":"IF(AND(OR(Share_Lab=\"Coinsurance\",Share_Lab=\"Copayment\"),Value_Lab=\"\"),\"Please enter a value\",IF(OR(AND(Share_Lab=\"Coinsurance\",Value_Lab>1),AND(Value_Lab<>\"\",OR(Share_Lab=\"Not Covered\",Share_Lab=\"No Cost Sharing\"))),\"Please correct\",\"\"))","v":""},null,null,"Not Covered"]
{"$rows_left_out":19}
{"sheet":"Automated Import","index":5,"n_rows":9,"n_cols":10,"rows_kept":9,"cut":false,"hidden":true,"merged":[[7,10,9,10],[0,9,1,10]]}
[null,"AUTOMATED IMPORT INSTRUCTIONS",null,null,null,null,null,null,null,"Switch to:"]
[null,"Close any previous CSV files that may be open."]
[null,"Click the 'Import & Run' button to compute the cost sharing for the different plans and export results to a CSV file."]
[]
[]
[]
[]
[]
[null,null,null,null,"Process multiple plans from a CSV import file:"]

{"sheet":"Diabetes Timeline","index":6,"n_rows":402,"n_cols":53,"rows_kept":402,"cut":false,"hidden":false,"merged":[[0,8,0,15],[0,17,0,30],[0,31,0,42],[0,43,0,51]]}
[null,null,null,null,null,null,null,null,"CATEGORIES",null,null,null,null,null,null,null,null,"COSTS",null,null,null,null,null,null,null,null,null,null,null,null,null,"DEDUCTIBLES",null,null,null,null,null,null,null,null,null,null,null,"LIMITS"]
["Date of Service","Diabetes Claim\nUnique Key","Diagnosis Code \n(ICD-9)","CPT©, HCPCS, or\nOther Billing Code","Provider\nType","Category"," Descriptor","Notes","DME","Generic RX","Hospital Care","Lab","Radiology","Obstetric","Vaccines","Visits","Amount Allowed","Insurer Expense","Running Insurer","Exclusions","Running Excl","Limitations","Running Limit","Deductible","Running Deduct","Copayment","Running Copay","Coinsurance","Running Coinsur","OOP Expense","Running OOP","Overall","Running Overall","DME","Running DME","Generic RX","Running RX","Hospital Care","Running Hospital","Obstetric","Running Obst","Vaccines","Running Vaccine","Dia RX per month","Running Dia RX Month","Dia RX per year","Running Dia RX Yr","DME\nper month","Running Dia DME Month","DME\nper year","Running Dia DME Yr","Visits\nper year","Running Visit Yr"]
["2011-01-03",25,{"$f":"IF(ISBLANK(VLOOKUP(Dia_Claim,Dia_UniqueLine,2,FALSE)),\"\",VLOOKUP(Dia_Claim,Dia_UniqueLine,2,FALSE))","v":"250.00, V58.66, V58.67"},{"$f":"IF(ISBLANK(VLOOKUP(Dia_Claim,Dia_UniqueLine,3,FALSE)),\"\",VLOOKUP(Dia_Claim,Dia_UniqueLine,3,FALSE))","v":"OTC"},{"$f":"IF(ISBLANK(VLOOKUP(Dia_Claim,Dia_UniqueLine,4,FALSE)),\"\",VLOOKUP(Dia_Claim,Dia_UniqueLine,4,FALSE))","v":"Pharmacy Retail"},{"$f":"IF(ISBLANK(VLOOKUP(Dia_Claim,Dia_UniqueLine,5,FALSE)),\"\",VLOOKUP(Dia_Claim,Dia_UniqueLine,5,FALSE))","v":"Medical equipment and supplies"},{"$f":"IF(ISBLANK(VLOOKUP(Dia_Claim,Dia_UniqueLine,6,FALSE)),\"\",VLOOKUP(Dia_Claim,Dia_UniqueLine,6,FALSE))","v":"Alcohol swabs (OTC - box of 100)  [usage = 3 wipes/day; 90 wipes/month]"},{"$f":"IF(ISBLANK(VLOOKUP(Dia_Claim,Dia_UniqueLine,8,FALSE)),\"\",VLOOKUP(Dia_Claim,Dia_UniqueLine,8,FALSE))","v":""},{"$f":"IF(Dia_Col_Category=\"Medical equipment and supplies\",1,\"\")","v":1},{"$f":"IF(AND(Dia_Col_Category=\"Pharmacy\",Dia_Col_BillCode<>\"OTC\"),1,\"\")","v":""},{"$f":"IF(AND(Dia_Col_Category=\"Anesthesia\",Dia_Col_Provider<>\"Inpatient facility\"),1,\"\")","v":""},{"$f":"IF(Dia_Col_Category=\"Laboratory tests\",1,\"\")","v":""},{"$f":"IF(Dia_Col_Category=\"Radiology\",1,\"\")","v":""},{"$f":"IF(Dia_Col_BillCode=\"Bundled in global OB package - 59400\",1,\"\")","v":""},{"$f":"IF(Dia_Col_Category=\"Vaccines, other preventive\",1,\"\")","v":""},{"$f":"IF(Dia_Col_Category=\"Office visits & procedures\",1,\"\")","v":""},{"$f":"IF(ISBLANK(VLOOKUP(Dia_Claim,Dia_UniqueLine,7,FALSE)),\"\",VLOOKUP(Dia_Claim,Dia_UniqueLine,7,FALSE))","v":3},null,{"$f":"R3","v":0},3,{"$f":"T3","v":3},null,{"$f":"V3","v":0},null,{"$f":"X3","v":0},null,{"$f":"Z3","v":0},null,{"$f":"AB3","v":0},{"$f":"Dia_Col_Deduct+Dia_Col_Copay+Dia_Col_Coinsur","v":0},{"$f":"AD3","v":0},null,{"$f":"AF3","v":0},null,{"$f":"AH3","v":0},null,{"$f":"AJ3","v":0},null,{"$f":"AL3","v":0},null,{"$f":"AN3","v":0},null,{"$f":"AP3","v":0},null,{"$f":"AR3","v":0},null,{"$f":"AT3","v":0},null,{"$f":"AV3","v":0},null,{"$f":"AX3","v":0},null,{"$f":"AZ3","v":0}]
["2011-01-03",14,"250.00, V58.66, V58.67",8290328279,"Pharmacy Retail","Medical equipment and supplies","BD Ultrafine Insulin Syringes / 30G/ 0.5cc  [usage = 30 syringes per month]","",1,"","","","","","","",8.4,8.4,{"$f":"R4+S3","v":8.4},null,{"$f":"T4+U3","v":3},null,{"$f":"V4+W3","v":0},null,{"$f":"X4+Y3","v":0},null,{"$f":"Z4+AA3","v":0},null,{"$f":"AB4+AC3","v":0},0,{"$f":"AD4+AE3","v":0},null,{"$f":"AF4+AG3","v":0},null,{"$f":"AH4+AI3","v":0},null,{"$f":"AJ4+AK3","v":0},null,{"$f":"AL4+AM3","v":0},null,{"$f":"AN4+AO3","v":0},null,{"$f":"AP4+AQ3","v":0},null,{"$f":"AR4+AS3","v":0},null,{"$f":"AT4+AU3","v":0},null,{"$f":"AV4+AW3","v":0},null,{"$f":"AX4+AY3","v":0},null,{"$f":"AZ4+BA3","v":0}]
["2011-01-03",5,"250.00, V58.66, V58.67",53885039310,"Pharmacy Retail","Medical equipment and supplies","OneTouch Delica Lancets (100 per box)  [usage = 60 lancets per month]","",1,"","","","","","","",9,9,{"$f":"R5+S4","v":17.399999999999999},null,{"$f":"T5+U4","v":3},null,{"$f":"V5+W4","v":0},null,{"$f":"X5+Y4","v":0},null,{"$f":"Z5+AA4","v":0},null,{"$f":"AB5+AC4","v":0},0,{"$f":"AD5+AE4","v":0},null,{"$f":"AF5+AG4","v":0},null,{"$f":"AH5+AI4","v":0},null,{"$f":"AJ5+AK4","v":0},null,{"$f":"AL5+AM4","v":0},null,{"$f":"AN5+AO4","v":0},null,{"$f":"AP5+AQ4","v":0},null,{"$f":"AR5+AS4","v":0},null,{"$f":"AT5+AU4","v":0},null,{"$f":"AV5+AW4","v":0},null,{"$f":"AX5+AY4","v":0},null,{"$f":"AZ5+BA4","v":0}]
["2011-01-03",3,"250.00, V58.66, V58.67","53885014201","Pharmacy Retail","Medical equipment and supplies","OneTouch Delica Lancing Device ","",1,"","","","","","","",18,18,35.4,null,3,null,0,null,0,null,0,null,0,0,0,null,0,null,0,null,0,null,0,null,0,null,0,null,0,null,0,null,0,null,0,null,0]
["2011-01-03",7,"250.00, V58.66, V58.67",53885044801,"Pharmacy Retail","Medical equipment and supplies","OneTouch Ultra 2 Blood Glucose Meter Kit","",1,"","","","","","","",66,66,101.4,null,3,null,0,null,0,null,0,null,0,0,0,null,0,null,0,null,0,null,0,null,0,null,0,null,0,null,0,null,0,null,0,null,0]
["2011-01-03",4,"250.00, V58.66, V58.67",53885024510,"Pharmacy Retail","Medical equipment and supplies","OneTouch Ultra Blue Test Strips (Rx - box of 100) [usage = 2 strips/day; 60 per month] ","",1,"","","","","","","",123.6,123.6,225,null,3,null,0,null,0,null,0,null,0,0,0,null,0,null,0,null,0,null,0,null,0,null,0,null,0,null,0,null,0,null,0,null,0]
["2011-01-03",6,"250.00, V58.66, V58.67","53885041601","Pharmacy Retail","Medical equipment and supplies","OneTouch Ultra Control Solution (2 vials/box)","",1,"","","","","","","",6.02,6.02,231.02,null,3,null,0,null,0,null,0,null,0,0,0,null,0,null,0,null,0,null,0,null,0,null,0,null,0,null,0,null,0,null,0,null,0]
["2011-01-03",26,"250.00, V58.66, V58.67","OTC","Pharmacy Retail","Pharmacy","Aspirin 81mg (OTC - bottle 100) [usage = 1 QD; #30 pills per month]","","","","","","","","","",8,null,231.02,8,11,null,0,null,0,null,0,null,0,0,0,null,0,null,0,null,0,null,0,null,0,null,0,null,0,null,0,null,0,null,0,null,0]
{"$rows_left_out":393}
{"sheet":"Maternity Timeline","index":7,"n_rows":400,"n_cols":47,"rows_kept":400,"cut":false,"hidden":false,"merged":[[0,17,0,30],[0,31,0,42],[0,43,0,46],[0,8,0,15]]}
[null,null,null,null,null,null,null,null,"CATEGORIES",null,null,null,null,null,null,null,null,"COSTS",null,null,null,null,null,null,null,null,null,null,null,null,null,"DEDUCTIBLES",null,null,null,null,null,null,null,null,null,null,null,"LIMITS"]
["Date of\nService","Maternity Claim\nUnique Key","Diagnosis Code \n(ICD-9)","CPT©, HCPCS, or\nOther Billing Code","Provider\nType","Category"," Descriptor","Notes","DME","Generic RX","Hospital Care","Lab","Radiology","Obstetric","Vaccines","Visits","Amount Allowed","Insurer Expense","Running Insurer","Exclusions","Running Excl","Limitations","Running Limit","Deductible","Running Deduct","Copayment","Running Copay","Coinsurance","Running Coinsur","OOP","Running OOP","Overall","Running Overall","DME","Running DME","Generic RX","Running RX","Hospital Care","Running Hospital","Obstetric","Running Obst","Vaccines","Running Vaccine","Mat RX per month","Running Mat RX Month","Mat RX per year","Running Mat RX Yr"]
["2011-01-07",8,{"$f":"IF(ISBLANK(VLOOKUP(Mat_Claim,Mat_UniqueLine,2,FALSE)),\"\",VLOOKUP(Mat_Claim,Mat_UniqueLine,2,FALSE))","v":""},{"$f":"IF(ISBLANK(VLOOKUP(Mat_Claim,Mat_UniqueLine,3,FALSE)),\"\",VLOOKUP(Mat_Claim,Mat_UniqueLine,3,FALSE))","v":"OTC"},{"$f":"IF(ISBLANK(VLOOKUP(Mat_Claim,Mat_UniqueLine,4,FALSE)),\"\",VLOOKUP(Mat_Claim,Mat_UniqueLine,4,FALSE))","v":"Pharmacy Retail"},{"$f":"IF(ISBLANK(VLOOKUP(Mat_Claim,Mat_UniqueLine,5,FALSE)),\"\",VLOOKUP(Mat_Claim,Mat_UniqueLine,5,FALSE))","v":"Pharmacy"},{"$f":"IF(ISBLANK(VLOOKUP(Mat_Claim,Mat_UniqueLine,6,FALSE)),\"\",VLOOKUP(Mat_Claim,Mat_UniqueLine,6,FALSE))","v":"Prenatal Vitamins (OTC - Bottle of 100) [1 pill daily; 30 pills/month]"},{"$f":"IF(ISBLANK(VLOOKUP(Mat_Claim,Mat_UniqueLine,8,FALSE)),\"\",VLOOKUP(Mat_Claim,Mat_UniqueLine,8,FALSE))","v":""},{"$f":"IF(Mat_Col_Category=\"Medical equipment and supplies\",1,\"\")","v":""},{"$f":"IF(AND(Mat_Col_Category=\"Pharmacy\",Mat_Col_BillCode<>\"OTC\"),1,\"\")","v":""},{"$f":"IF(OR(Mat_Col_Category=\"Anesthesia\",Mat_Col_Provider=\"Inpatient Facility\"),1,\"\")","v":""},{"$f":"IF(Mat_Col_Category=\"Laboratory tests\",1,\"\")","v":""},{"$f":"IF(Mat_Col_Category=\"Radiology\",1,\"\")","v":""},{"$f":"IF(Mat_Col_BillCode=\"Bundled in global OB package - 59400\",1,\"\")","v":""},{"$f":"IF(Mat_Col_Category=\"Vaccines, other preventive\",1,\"\")","v":""},{"$f":"IF(Mat_Col_Category=\"Office visits & procedures\",1,\"\")","v":""},{"$f":"IF(ISBLANK(VLOOKUP(Mat_Claim,Mat_UniqueLine,7,FALSE)),\"\",VLOOKUP(Mat_Claim,Mat_UniqueLine,7,FALSE))","v":30},null,{"$f":"R3","v":0},30,{"$f":"T3","v":30},null,{"$f":"V3","v":0},null,{"$f":"X3","v":0},null,{"$f":"Z3","v":0},null,{"$f":"AB3","v":0},{"$f":"Mat_Col_Deduct+Mat_Col_Copay+Mat_Col_Coinsur","v":0},{"$f":"AD3","v":0},null,{"$f":"AF3","v":0},null,{"$f":"AH3","v":0},null,{"$f":"AJ3","v":0},null,{"$f":"AL3","v":0},null,{"$f":"AN3","v":0},null,{"$f":"AP3","v":0},null,{"$f":"AR3","v":0},null,{"$f":"AT3","v":0}]
["2011-04-01",14,"V22.0",80055,"OBGYN","Laboratory tests","Obstetric Panel","80055 - Global OB panel code","","","",1,"","","","",54.239906423000001,54.239906423000001,{"$f":"S3+R4","v":54.239906423000001},null,{"$f":"U3+T4","v":30},null,{"$f":"W3+V4","v":0},null,{"$f":"Y3+X4","v":0},null,{"$f":"AA3+Z4","v":0},null,{"$f":"AC3+AB4","v":0},0,{"$f":"AE3+AD4","v":0},null,{"$f":"AG3+AF4","v":0},null,{"$f":"AI3+AH4","v":0},null,{"$f":"AK3+AJ4","v":0},null,{"$f":"AM3+AL4","v":0},null,{"$f":"AO3+AN4","v":0},null,{"$f":"AQ3+AP4","v":0},null,{"$f":"AS3+AR4","v":0},null,{"$f":"AU3+AT4","v":0}]
["2011-04-01",30,"V22.0","87801 x2","OBGYN","Laboratory tests","Detect agnt mult dna ampli ","Gonorrhea / Chlamydia screen","","","",1,"","","","",9.4479524864000002,9.4479524864000002,{"$f":"S4+R5","v":63.687858909399999},null,{"$f":"U4+T5","v":30},null,{"$f":"W4+V5","v":0},null,{"$f":"Y4+X5","v":0},null,{"$f":"AA4+Z5","v":0},null,{"$f":"AC4+AB5","v":0},0,{"$f":"AE4+AD5","v":0},null,{"$f":"AG4+AF5","v":0},null,{"$f":"AI4+AH5","v":0},null,{"$f":"AK4+AJ5","v":0},null,{"$f":"AM4+AL5","v":0},null,{"$f":"AO4+AN5","v":0},null,{"$f":"AQ4+AP5","v":0},null,{"$f":"AS4+AR5","v":0},null,{"$f":"AU4+AT5","v":0}]
["2011-04-01",31,"V22.0",88164,"OBGYN","Laboratory tests","Cytopath TBS C/V Manual","Pap smear","","","",1,"","","","",14.735122969000001,14.735122969000001,78.422981878399995,null,30,null,0,null,0,null,0,null,0,0,0,null,0,null,0,null,0,null,0,null,0,null,0,null,0,null,0]
["2011-04-01",28,"V22.0",86701,"OBGYN","Laboratory tests","HIV-1","","","","",1,"","","","",12.935806004,12.935806004,91.358787882399994,null,30,null,0,null,0,null,0,null,0,0,0,null,0,null,0,null,0,null,0,null,0,null,0,null,0,null,0]
["2011-04-01",12,"V22.0",36415,"OBGYN","Laboratory tests","Routine Venipuncture","Cystic fibrosis screen","","","",1,"","","","",4.1312550556999996,4.1312550556999996,95.49004293809999,null,30,null,0,null,0,null,0,null,0,0,0,null,0,null,0,null,0,null,0,null,0,null,0,null,0,null,0]
["2011-04-01",35,"V72.42",81025,"OBGYN","Laboratory tests","Urine Pregnancy Test","","","","",1,"","","","",8.8680026237000007,8.8680026237000007,104.3580455618,null,30,null,0,null,0,null,0,null,0,0,0,null,0,null,0,null,0,null,0,null,0,null,0,null,0,null,0]
["2011-04-01",32,"V22.0","Bundled in global OB package - 59400","OBGYN","Routine Obstetric Care","Office/Outpatient Visit Est","","","","","","",1,"","",2084.2800000000002,1044.2800000000002,1148.6380455618003,null,30,null,0,1000,1000,40,40,null,0,1040,1040,1000,1000,null,0,null,0,null,0,null,0,null,0,null,0,null,0]
{"$rows_left_out":391}
{"sheet":"Manual Results","index":8,"n_rows":16,"n_cols":12,"rows_kept":16,"cut":false,"hidden":true,"merged":[[0,7,2,10],[6,3,6,4],[9,3,9,4],[4,2,4,6],[4,8,4,12],[6,9,6,10],[9,9,9,10]]}
[null,null,null,null,null,null,null,"Re-run Calculator:   "]
[]
[null,"MANUAL ENTRY RESULTS"]
[]
[null,null,"Maternity Scenario",null,null,null,null,null,"Diabetes Type 2 Scenario"]
[]
[null,null,null,"Plan Pays:",null,{"$f":"7540-F16","v":4940},null,null,null,"Plan Pays:",null,{"$f":"5400-L16","v":3810}]
[]
[]
[null,null,null,"Patient Pays:",null,"Maternity",null,null,null,"Patient Pays:",null,"Diabetes"]
{"$rows_left_out":7}
{"sheet":"Automated Results","index":9,"n_rows":6,"n_cols":8,"rows_kept":6,"cut":false,"hidden":true,"merged":[[5,4,6,8]]}
[]
[null,null,null,null,null,null,null,"Rerun Calculator: "]
[null,"AUTOMATED IMPORT RESULTS"]
[]
[]
[null,null,null,null,"The results for the two scenarios are currently open in a separate file.\nThe resulting CSV file was saved in the same location as the input file. "]

{"sheet":"Orig Scenario","index":10,"n_rows":121,"n_cols":7,"rows_kept":121,"cut":false,"hidden":true,"merged":[[0,4,0,5],[0,0,0,1]]}
["Mat",null,"Check Chrono",null,"Dia",null,"Check Chrono"]
["2011-01-07",8,null,null,"2011-01-03",25]
["2011-04-01",14,{"$f":"IF(A3>=A2,\"\",\"Err\")","v":""},null,"2011-01-03",14,{"$f":"IF(E3>=E2,\"\",\"Err\")","v":""}]
["2011-04-01",30,{"$f":"IF(A4>=A3,\"\",\"Err\")","v":""},null,"2011-01-03",5,{"$f":"IF(E4>=E3,\"\",\"Err\")","v":""}]
["2011-04-01",31,{"$f":"IF(A5>=A4,\"\",\"Err\")","v":""},null,"2011-01-03",3,""]
["2011-04-01",28,"",null,"2011-01-03",7,""]
["2011-04-01",12,"",null,"2011-01-03",4,""]
["2011-04-01",35,"",null,"2011-01-03",6,""]
["2011-04-01",32,"",null,"2011-01-03",26,""]
["2011-04-07",32,"",null,"2011-01-03",1,""]
{"$rows_left_out":112}
{"sheet":"Import","index":11,"n_rows":0,"n_cols":0,"rows_kept":0,"cut":false,"hidden":true,"merged":[]}

{"sheet":"Import Entry","index":12,"n_rows":22,"n_cols":8,"rows_kept":22,"cut":false,"hidden":true,"merged":[]}
[{"$f":"MATCH(INDIRECT(\"Import!A1\"),Cost_Sharing_List_4,0)","v":{"$error":"#N/A"}},{"$f":"IF(INDIRECT(\"Import!B1\")=\"\",\"\",INDIRECT(\"Import!B1\"))","v":""},null,null,"Import_Codes",null,null,{"$f":"ISERROR(A1)","v":true}]
[{"$f":"MATCH(INDIRECT(\"Import!C1\"),Cost_Sharing_List_4,0)","v":{"$error":"#N/A"}},{"$f":"IF(INDIRECT(\"Import!D1\")=\"\",\"\",INDIRECT(\"Import!D1\"))","v":""},null,null,"Import_Values1",null,null,{"$f":"ISERROR(A2)","v":true}]
[{"$f":"MATCH(INDIRECT(\"Import!E1\"),Cost_Sharing_List_4,0)","v":{"$error":"#N/A"}},{"$f":"IF(INDIRECT(\"Import!F1\")=\"\",\"\",INDIRECT(\"Import!F1\"))","v":""},null,null,"Import_Values2",null,null,true]
[{"$f":"MATCH(INDIRECT(\"Import!G1\"),Cost_Sharing_List_4,0)","v":{"$error":"#N/A"}},{"$f":"IF(INDIRECT(\"Import!H1\")=\"\",\"\",INDIRECT(\"Import!H1\"))","v":""},null,null,null,null,null,true]
[{"$f":"MATCH(INDIRECT(\"Import!I1\"),Cost_Sharing_List_4,0)","v":{"$error":"#N/A"}},{"$f":"IF(INDIRECT(\"Import!J1\")=\"\",\"\",INDIRECT(\"Import!J1\"))","v":""},null,null,null,null,null,true]
[{"$f":"MATCH(INDIRECT(\"Import!K1\"),Cost_Sharing_List_5,0)","v":{"$error":"#N/A"}},{"$f":"IF(INDIRECT(\"Import!L1\")=\"\",\"\",INDIRECT(\"Import!L1\"))","v":""},null,null,null,null,null,true]
[{"$f":"MATCH(INDIRECT(\"Import!M1\"),Cost_Sharing_List_4,0)","v":{"$error":"#N/A"}},{"$f":"IF(INDIRECT(\"Import!N1\")=\"\",\"\",INDIRECT(\"Import!N1\"))","v":""},null,null,null,null,null,true]
[{"$f":"MATCH(INDIRECT(\"Import!O1\"),Cost_Sharing_List_4,0)","v":{"$error":"#N/A"}},{"$f":"IF(INDIRECT(\"Import!P1\")=\"\",\"\",INDIRECT(\"Import!P1\"))","v":""},null,null,null,null,null,true]
[null,{"$f":"IF(INDIRECT(\"Import!Q1\")=\"\",\"\",INDIRECT(\"Import!Q1\"))","v":""},null,null,null,null,"Error_Count_Import",{"$f":"COUNTIF(H1:H8,\"TRUE\")","v":8}]
[null,{"$f":"IF(INDIRECT(\"Import!R1\")=\"\",\"\",INDIRECT(\"Import!R1\"))","v":""}]
{"$rows_left_out":13}
{"sheet":"Import Results","index":13,"n_rows":2,"n_cols":43,"rows_kept":2,"cut":false,"hidden":true,"merged":[]}
["No Cost Sharing",null,"Copayment",10,"Coinsurance",0.2,"No Cost Sharing",null,"Coinsurance",0.2,"Copayment",30,"No Cost Sharing",null,"Copayment",30,null,1000,null,null,null,null,null,null,null,null,null,null,null,"Maternity",5410,1000,50,930,150,2130,"Diabetes",3810,1000,510,0,80,1590]
["No Cost Sharing",null,"Copayment",10,"Coinsurance",0.3,"No Cost Sharing",null,"Coinsurance",0.3,"Copayment",40,"No Cost Sharing",null,"Copayment",40,null,1000,null,100,null,null,null,null,null,null,null,null,null,"Maternity",4940,1020,40,1390,150,2600,"Diabetes",3810,1100,410,0,80,1590]