{"text_format":"1","workbook":"xlsx","n_sheets":6,"sheets":["Start Here","Formula Reference","Pt 1 Summary of Data","Pt 2 Premium and Claims","Pt 4 MLR and Rebate Calculation","Tables"],"not_rendered":{"charts":0,"images":0,"macros":1,"external_links":0,"defined_names":11,"comments":0,"pivot_tables":0},"unopened":[],"bounds":{"document_bytes":16777216,"sheet_cells":100000,"rows_first":2000,"rows_last":500,"rows_between":2000,"halvings":0,"cell_chars":16384,"cell_head_chars":4096},"cells_cut":0,"cells_raw":0,"read":"whole","date_system":"1900"}

{"sheet":"Start Here","index":0,"n_rows":29,"n_cols":2,"rows_kept":29,"cut":false,"hidden":false,"merged":[]}
[]
[null,"    INSTRUCTIONS FOR USING THE FORMULA REFERENCE AND FORMULA CALCULATOR WITH THE 2013 MLR ANNUAL REPORTING FORM"]
[]
[null,"The 2013 MLR Annual Reporting Form does not automatically perform the MLR and rebate calculations. When a completed form is submitted, CMS' Health Insurance Oversight System (HIOS) will alert companies if their submitted values do not match HIOS calculated values.\n"]
[null,"Companies may do the MLR and rebate calculations themselves, following the 2013 MLR Annual Reporting Form Filing Instructions.  For the user's convenience, all 2013 MLR and rebate formulas are summarized on the Formula Reference tab of this file.\n"]
[null,"Companies may also use the Formula Calculator included in the tabs of this file that are marked Part 1 Summary of Data, Part 2 Premium and Claims, and Part 4 MLR and Rebate Calculation to perform and/or verify their MLR and rebate calculations for the 2013 MLR reporting year.  To use the Formula Calculator, please follow Steps 1−5 below.  For your convenience if you choose this option, this Formula Calculator can also copy all data entered in this file into the HIOS template file you specify.  You may need to enable macros to use the optional Formula Calculator copy functionality; please contact your IT department for assistance."]
[]
[null,"Step 1.  Companies must download and use the HIOS template file(s) from the HIOS MLR module.  Do not use the MLR Form file posted on the MLR page of CCIIO's website, or this Formula Calculator file, to file MLR data in HIOS."]
[]
[null,"Step 2.  Make sure that this Formula Calculator file is placed in and opened from the same folder as the destination HIOS template file."]
[]
[null,"Step 3."]
[null,"(a) Do one of the following:"]
[null,"(i) Populate the blank cells on Parts 1, 2, and the relevant portions of Part 4 of the HIOS template file, and copy these data into the corresponding cells of this Formula Calculator file; OR"]
[null,"(ii) Populate the blank cells on Parts 1, 2, and the relevant portions of Part 4 of this Formula Calculator file, as you would populate the HIOS template file."]
{"$rows_left_out":15}
{"sheet":"Formula Reference","index":1,"n_rows":29,"n_cols":2,"rows_kept":29,"cut":false,"hidden":false,"merged":[[0,0,0,1]]}
["2013 MLR Annual Reporting Form: Formula Resource"]
["2013 Form Line","2013 Form Calculation References"]
["Part 1 Line 1.1\n(Total direct premium earned)","Part 2 Lines 1.1 + 1.2 – 1.3 – 1.7 + 1.8"]
["Part 1 Line 2.1 \n(Total incurred claims)","Part 2 Line 2.16\nPlease note that on the 2011 MLR Form, this line was equal to Part 2 Lines 2.16 + 2.17"]
["Part 1 Line 2.11\n(Allowable fraud reduction expense)","Part 2 Line 2.17"]
["Part 1 Line 7.5\n(Life-years)","Part 1 Line 7.4 / 12"]
["Part 2 Line 2.16\n(Total incurred claims)","Column \"Total as of 12/31/12\": \nPart 2 Lines 2.1a + 2.2a – 2.3 + 2.4a – 2.5 + 2.6a – 2.7 + 2.8a + 2.9a – 2.10 + 2.11a + 2.11b – 2.11c – 2.12a + 2.12b + 2.13 + 2.14 + 2.15\n\nAll other columns (\"3/31/13\", \"Dual Contract\", \"Deferred PY1\", \"Deferred CY\"):\nPart 2 Lines 2.1b + 2.2b + 2.4b + 2.6b – 2.7 + 2.8b + 2.9b + 2.11a + 2.11b – 2.12a + 2.13 + 2.14 + 2.15"]
["Part 2 Line 2.17\n(Allowable fraud reduction expense)","The lesser of: Part 2 Line 2.17a or 2.17b"]
["Part 4 Line 1.1\n(Adjusted incurred claims as reported on MLR Form for prior year(s))","Column \"PY2\":\n2011 MLR Form, Part 1 Line 2.1, Columns \"3/31/YY\" + \"Deferred PY\" – \"Deferred CY\"\n\nColumn \"PY1\":\n2012 MLR Form, (Part 1 Line 2.1, Columns \"3/31/YY\" + \"Deferred PY\" – \"Deferred CY\") + \n                            (Part 2 Line 2.17, Columns \"3/31/YY\" + \"Deferred PY\" – \"Deferred CY\")"]
["Part 4 Line 1.2\n(Adjusted incurred claims as of 3/31 of the year following the MLR reporting year)","Column \"PY2\":\nAdjusted claims incurred in the 2011 MLR reporting year, restated as of 3/31/14\n\nColumn \"PY1\":\nAdjusted claims incurred in the 2012 MLR reporting year, restated as of 3/31/14\n\nColumn \"CY\":\n(Part 1 Line 2.1, Columns \"3/31/13\" + \"Deferred PY1\" – \"Deferred CY\") + \n(Part 1 Line 2.11, Columns \"3/31/13\" + \"Deferred PY1\" – \"Deferred CY\")\n\nColumn \"Total\": \nPart 4 Line 1.2, Columns PY2 + PY1 + CY"]
["Part 4 Line 1.3\n(Quality improvement expenses)","Column \"PY2\":\n2011 MLR Form, Part 1 Line 4.6, Columns \"3/31/YY\" + \"Deferred PY\" – \"Deferred CY\"\n\nColumn \"PY1\":\n2012 MLR Form, (Part 1 Line 4.1, Columns \"3/31/13\" + \"Deferred PY1\" – \"Deferred CY\") + (Part 1 Line 4.2, Columns \"3/31/13\" + \"Deferred PY1\" – \"Deferred CY\") + \n                            (Part 1 Line 4.3, Columns \"3/31/13\" + \"Deferred PY1\" – \"Deferred CY\") + (Part 1 Line 4.4, Columns \"3/31/13\" + \"Deferred PY1\" – \"Deferred CY\") + \n                            (Part 1 Line 4.5, Columns \"3/31/13\" + \"Deferred PY1\" – \"Deferred CY\") + (Part 1 Line 4.6, Columns \"3/31/13\" + \"Deferred PY1\" – \"Deferred CY\")\n\nColumn \"CY\":\n(Part 1 Line 4.1, Columns \"3/31/13\" + \"Deferred PY1\" – \"Deferred CY\") + (Part 1 Line 4.2, Columns \"3/31/13\" + \"Deferred PY1\" – \"Deferred CY\") + \n(Part 1 Line 4.3, Columns \"3/31/13\" + \"Deferred PY1\" – \"Deferred CY\") + (Part 1 Line 4.4, Columns \"3/31/13\" + \"Deferred PY1\" – \"Deferred CY\") + \n(Part 1 Line 4.5, Columns \"3/31/13\" + \"Deferred PY1\" – \"Deferred CY\") + (Part 1 Line 4.6, Columns \"3/31/13\" + \"Deferred PY1\" – \"Deferred CY\")\n\nColumn \"Total\": \nPart 4 Line 1.3, Columns PY2 + PY1 + CY"]
["Part 4 Line 1.4\n(MLR rebates based on 2011 experience)","Column \"PY2\":\n2011 MLR Form, Part 5 Line 5.4\n\nColumn \"PY1\":\n2012 MLR Form, Part 4 Line 5.4\n\nColumn \"Total\": \nPart 4 Line 1.4, Columns PY2 + PY1"]
["Part 4 Line 1.5\n(MLR numerator)","Individual, Small Group, and Large Group Columns \"PY2\", \"PY1\", \"CY\", except MA merged markets:\nPart 4, Lines 1.2 + 1.3\nIndividual and Small Group Columns \"PY2\", \"PY1\", \"CY\", if Business State is MA: \n(Part 4, Individual Column, Lines 1.2 + 1.3) + (Part 4, Small Group Column, Lines 1.2 + 1.3)\n\nIndividual, Small Group, and Large Group Columns \"Total\", except MA merged markets:\nPart 4, Lines 1.2 + 1.3 + 1.4\nIndividual and Small Group Columns \"Total\", if Business State is MA: \n(Part 4, Individual Column, Lines 1.2 + 1.3 + 1.4) + (Part 4, Small Group Column, Lines 1.2 + 1.3 + 1.4)"]
["Part 4 Line 1.6\n(MLR numerator: Mini-Med and Student Health Plans)","Mini-Med Column \"PY2\", except MA merged markets:\n2.0 x (Part 4 Lines 1.2 + 1.3)\nMini-Med Individual and Small Group Columns \"PY2\", if Business State is MA: \n2.0 x [(Part 4, Mini-Med Individual Column, Lines 1.2 + 1.3) + (Part 4, Mini-Med Small Group Column, Lines 1.2 + 1.3)]\n\nMini-Med Column \"PY1\", except MA merged markets:\n1.75 x (Part 4 Lines 1.2 + 1.3)\nMini-Med Individual and Small Group Columns \"PY1\", if Business State is MA: \n1.75 x [(Part 4, Mini-Med Individual Column, Lines 1.2 + 1.3) + (Part 4, Mini-Med Small Group Column, Lines 1.2 + 1.3)]\n\nMini-Med Column \"CY\", except MA merged markets:\n1.5 x (Part 4 Lines 1.2 + 1.3)\nMini-Med Individual and Small Group Columns \"CY\", if Business State is MA: \n1.5 x [(Part 4, Mini-Med Individual Column, Lines 1.2 + 1.3) + (Part 4, Mini-Med Small Group Column, Lines 1.2 + 1.3)]\n\nMini-Med Column \"Total\", except MA merged markets:\n1.5 x (Part 4 Lines 1.2 + 1.3 + 1.4)\nMini-Med Individual and Small Group Columns \"Total\", if Business State is MA: \n1.5 x [(Part 4, Mini-Med Individual Column, Lines 1.2 + 1.3 + 1.4) + (Part 4, Mini-Med Small Group Column, Lines 1.2 + 1.3 + 1.4)]\n\nStudent Health Plans columns, Grand Total template only:\n1.15 x (Part 4 Column \"Total\", Lines 1.2 + 1.3 + 1.4)"]
["Part 4 Line 2.1\n(Premium earned including Federal and State high risk programs)","Column \"PY2\":\n2011 MLR Form, Part 1 Line 1.4, Columns \"3/31/YY\" + \"Deferred PY\" – \"Deferred CY\"\n\nColumn \"PY1\":\n2012 MLR Form, (Part 1 Line 1.1, Columns \"3/31/13\" + \"Deferred PY1\" – \"Deferred CY\") + \n                            (Part 1 Line 1.2, Columns \"3/31/13\" + \"Deferred PY1\" – \"Deferred CY\") + \n                            (Part 1 Line 1.3, Columns \"3/31/13\" + \"Deferred PY1\" – \"Deferred CY\")  \n\nColumn \"CY\":\n(Part 1 Line 1.1, Columns \"3/31/13\" + \"Deferred PY1\" – \"Deferred CY\") + \n(Part 1 Line 1.2, Columns \"3/31/13\" + \"Deferred PY1\" – \"Deferred CY\") + \n(Part 1 Line 1.3, Columns \"3/31/13\" + \"Deferred PY1\" – \"Deferred CY\") –\n Part 4 Line 6.1a\n\nColumn \"Total\": \nPart 4 Line 2.1, Columns PY2 + PY1 + CY"]
{"$rows_left_out":15}
{"sheet":"Pt 1 Summary of Data","index":2,"n_rows":87,"n_cols":48,"rows_kept":87,"cut":false,"hidden":false,"merged":[[14,44,15,44],[15,26,15,28],[14,47,15,47],[14,46,15,46],[14,45,15,45],[7,5,7,6],[9,5,9,6],[11,5,11,6],[14,5,14,19],[14,29,14,38],[14,20,14,28],[15,10,15,14],[15,15,15,19],[7,11,7,12],[9,11,9,12],[7,8,7,9],[9,8,9,9],[86,2,86,3],[83,2,83,3],[5,11,5,12],[15,39,15,43],[14,39,14,43],[77,5,78,5],[11,8,11,9],[11,11,11,12],[5,5,5,6],[16,1,17,3],[16,4,17,4],[15,29,15,33],[15,34,15,38],[15,20,15,22],[15,23,15,25],[15,5,15,9]]}
[null,"Department of Health and Human Services"]
[null,"Medical Loss Ratio Reporting Form - Formula Tool"]
[null,"Part 1 - Summary of Data"]
[]
[null,null,null,null,null,null,null,null,null,null,null,"Federal Tax Exempt "]
[null,null,null,null,null,null,null,null,null,null,null,"No"]
[null,null,null,null,null,null,null,null,null,null,null,"Merge Markets - Ind/SmGrp"]
[null,null,null,null,null,null,null,null,null,null,null,"No"]
[null,null,null,null,null,null,null,null,"Business in the State of:"]
[]
[null,null,null,null,null,null,null,null,null,null,null,"MLR Reporting Year:"]
[null,null,null,null,null,null,null,null,null,null,null,2013]
[]
[]
[null,null,null,null,null,"Health Insurance Coverage",null,null,null,null,null,null,null,null,null,null,null,null,null,null,"Mini-Med Plans",null,null,null,null,null,null,null,null,"Expatriate Plans",null,null,null,null,null,null,null,null,null,"Student Health Plans",null,null,null,null,"Government Program Plans","Other Health Business","Aggregate 2% Rule","Uninsured Plans"]
{"$rows_left_out":73}
{"sheet":"Pt 2 Premium and Claims","index":3,"n_rows":76,"n_cols":48,"rows_kept":76,"cut":false,"hidden":false,"merged":[[14,45,15,45],[14,46,15,46],[16,1,17,3],[16,4,17,4],[5,5,5,6],[7,5,7,6],[11,5,11,6],[9,5,9,6],[15,39,15,43],[14,39,14,43],[7,8,7,9],[9,8,9,9],[11,8,11,9],[7,11,7,12],[9,11,9,12],[11,11,11,12],[75,3,75,4],[72,3,72,4],[5,11,5,12],[14,47,15,47],[15,5,15,9],[15,10,15,14],[15,15,15,19],[15,20,15,22],[15,23,15,25],[15,26,15,28],[14,5,14,19],[14,20,14,28],[14,29,14,38],[15,29,15,33],[15,34,15,38],[14,44,15,44]]}
[null,"Department of Health and Human Services"]
[null,"Medical Loss Ratio Reporting Form - Formula Tool"]
[null,"Part 2 - Premium and Claims"]
[]
[]
[]
[]
[]
[]
[]
[]
[]
[]
[]
[null,null,null,null,null,"Health Insurance Coverage",null,null,null,null,null,null,null,null,null,null,null,null,null,null,"Mini-Med Plans",null,null,null,null,null,null,null,null,"Expatriate Plans",null,null,null,null,null,null,null,null,null,"Student Health Plans",null,null,null,null,"Government Program Plans","Other Health Business","Aggregate 2% Rule","Uninsured Plans"]
{"$rows_left_out":62}
{"sheet":"Pt 4 MLR and Rebate Calculation","index":4,"n_rows":64,"n_cols":40,"rows_kept":64,"cut":false,"hidden":false,"merged":[[5,1,5,3],[7,1,7,3],[7,11,7,12],[7,5,7,6],[1,5,1,6],[3,5,3,6],[1,8,1,9],[5,11,5,12],[3,8,3,9],[3,11,3,12],[5,5,5,6],[5,8,5,9],[10,16,10,19],[10,20,10,23],[10,24,10,27],[9,16,9,27],[7,8,7,9],[63,3,63,4],[60,3,60,4],[1,37,1,38],[3,37,3,38],[5,37,5,38],[7,37,7,38],[10,36,10,39],[9,36,9,39],[11,1,12,3],[9,28,9,35],[10,28,10,31],[10,32,10,35],[10,4,10,7],[10,8,10,11],[10,12,10,15],[9,4,9,15]]}
[null,"Department of Health and Human Services"]
[null,"Medical Loss Ratio Reporting Form - Formula Tool",null,null,null,"",null,null,"",null,null,null,null,null,null,null,null,null,null,null,null,null,null,null,null,null,null,null,null,null,null,null,null,null,null,null,null,""]
[null,"Part 4 - MLR and Rebate Calculation",null,null,null,null,null,null,null,null,null,"Merge Markets - Ind/SmGrp (MA Only)"]
[null,null,null,null,null,"",null,null,"",null,null,{"$f":"'Pt 1 Summary of Data'!$L$8","v":"No"},null,null,null,null,null,null,null,null,null,null,null,null,null,null,null,null,null,null,null,null,null,null,null,null,null,""]
[null,null,null,null,null,null,null,null,"Business in the State of:"]
[null,"",null,null,null,"",null,null,{"$f":"IF(ISBLANK('Pt 1 Summary of Data'!$I$10),\"\",'Pt 1 Summary of Data'!$I$10)","v":""},null,null,"",null,null,null,null,null,null,null,null,null,null,null,null,null,null,null,null,null,null,null,null,null,null,null,null,null,""]
[null,null,null,null,null,null,null,null,null,null,null,"MLR Reporting Year:"]
[null,"",null,null,null,"",null,null,"",null,null,{"$f":"'Pt 1 Summary of Data'!$L$12","v":2013},null,null,null,null,null,null,null,null,null,null,null,null,null,null,null,null,null,null,null,null,null,null,null,null,null,""]
[]
[null,null,null,null,"Health Insurance Coverage",null,null,null,null,null,null,null,null,null,null,null,"Mini-Med Plans",null,null,null,null,null,null,null,null,null,null,null,"Expatriate Plans",null,null,null,null,null,null,null,"Student Health Plans"]
[null,null,null,null,"Individual",null,null,null,"Small Group",null,null,null,"Large Group",null,null,null,"Individual",null,null,null,"Small Group",null,null,null,"Large Group",null,null,null,"Small Group",null,null,null,"Large Group",null,null,null,"Individual"]
[null,"Part 4\nNOTE: REFER TO MLR INSTRUCTIONS, FORMULAS RESOURCE AND TABLES RESOURCE FOR IMPORTANT INFORMATION ABOUT COMPLETING EACH COLUMN AND ROW.",null,null,"PY2","PY1","CY","Total ","PY2","PY1","CY","Total","PY2","PY1","CY","Total","PY2","PY1","CY","Total ","PY2","PY1","CY","Total","PY2","PY1","CY","Total","PY2","PY1","CY","Total ","PY2","PY1","CY","Total","PY2","PY1","CY","Total "]
[null,null,null,null,1,2,3,4,5,6,7,8,9,10,11,12,13,14,15,16,17,18,19,20,21,22,23,24,25,26,27,28,29,30,31,32,33,34,35,36]
[null,"1.","Medical Loss Ratio Numerator"]
[null,null,1.1000000000000001,"Adjusted incurred claims as reported on MLR Form for prior year(s)"]
{"$rows_left_out":50}
{"sheet":"Tables","index":5,"n_rows":63,"n_cols":18,"rows_kept":63,"cut":false,"hidden":false,"merged":[[2,0,2,1],[3,0,3,1],[15,0,15,1],[16,0,16,1]]}
[]
[]
["Table 1",null,null,null,null,null,null,"Table 3",null,null,null,null,null,null,null,"Table 4",null,"Table 5"]
["Base Credibility Adjustment Factors",null,null,null,null,null,null,"State and Territory Names",null,null,null,null,null,null,null,"Reporting Years",null,"Yes/No"]
["Life Years","Base credibility factor",null,null,null,null,null,"Alabama",null,null,null,null,null,null,null,2011,null,"Yes"]
[0,0,null,null,null,null,null,"Alaska",null,null,null,null,null,null,null,2012,null,"No"]
[1000,8.3000000000000004E-2,null,null,null,null,null,"American Samoa",null,null,null,null,null,null,null,2013]
[2500,5.1999999999999998E-2,null,null,null,null,null,"Arizona",null,null,null,null,null,null,null,2014]
[5000,3.6999999999999998E-2,null,null,null,null,null,"Arkansas",null,null,null,null,null,null,null,2015]
[10000,2.5999999999999999E-2,null,null,null,null,null,"California",null,null,null,null,null,null,null,2016]
[25000,1.6E-2,null,null,null,null,null,"Canada",null,null,null,null,null,null,null,2017]
[50000,1.2E-2,null,null,null,null,null,"Colorado",null,null,null,null,null,null,null,2018]
[75000,0,null,null,null,null,null,"Connecticut",null,null,null,null,null,null,null,2019]
[null,null,null,null,null,null,null,"Delaware",null,null,null,null,null,null,null,2020]
[null,null,null,null,null,null,null,"District of Columbia",null,null,null,null,null,null,null,2021]
{"$rows_left_out":48}